sbuild (Debian sbuild) 0.85.0 (04 January 2023) on debian-ci-siliconvalley

+==============================================================================+
| muon-meson 0.3.0-3 (s390x)                   Thu, 10 Oct 2024 08:41:25 +0000 |
+==============================================================================+

Package: muon-meson
Version: 0.3.0-3
Source Version: 0.3.0-3
Distribution: unstable
Machine Architecture: amd64
Host Architecture: s390x
Build Architecture: amd64
Build Profiles: cross nocheck
Build Type: any

I: NOTICE: Log filtering will replace 'var/run/schroot/mount/sid-amd64-sbuild-f7c2febb-7c01-407c-8ee4-7276ea6dfb39' with '<<CHROOT>>'
I: NOTICE: Log filtering will replace 'build/muon-meson-DqWON5/resolver-xaxkcE' with '<<RESOLVERDIR>>'

+------------------------------------------------------------------------------+
| Update chroot                                                                |
+------------------------------------------------------------------------------+

Get:1 http://localhost:3142/debian sid InRelease [202 kB]
Get:2 http://localhost:3142/debian sid/main Sources.diff/Index [63.6 kB]
Get:3 http://localhost:3142/debian sid/main amd64 Packages.diff/Index [63.6 kB]
Get:4 http://localhost:3142/debian sid/main Sources T-2024-10-10-0222.42-F-2024-10-10-0222.42.pdiff [37.3 kB]
Get:5 http://localhost:3142/debian sid/main amd64 Packages T-2024-10-10-0222.42-F-2024-10-10-0222.42.pdiff [38.2 kB]
Get:4 http://localhost:3142/debian sid/main Sources T-2024-10-10-0222.42-F-2024-10-10-0222.42.pdiff [37.3 kB]
Get:6 http://localhost:3142/debian sid/main s390x Packages [9589 kB]
Get:5 http://localhost:3142/debian sid/main amd64 Packages T-2024-10-10-0222.42-F-2024-10-10-0222.42.pdiff [38.2 kB]
Fetched 9994 kB in 2s (4831 kB/s)
Reading package lists...
Reading package lists...
Building dependency tree...
Reading state information...
Calculating upgrade...
0 upgraded, 0 newly installed, 0 to remove and 0 not upgraded.

+------------------------------------------------------------------------------+
| Fetch source files                                                           |
+------------------------------------------------------------------------------+


Check APT
---------

Checking available source versions...

Download source files with APT
------------------------------

Reading package lists...
NOTICE: 'muon-meson' packaging is maintained in the 'Git' version control system at:
https://salsa.debian.org/debian/muon-meson.git
Please use:
git clone https://salsa.debian.org/debian/muon-meson.git
to retrieve the latest (possibly unreleased) updates to the package.
Need to get 788 kB of source archives.
Get:1 http://localhost:3142/debian sid/main muon-meson 0.3.0-3 (dsc) [1914 B]
Get:2 http://localhost:3142/debian sid/main muon-meson 0.3.0-3 (tar) [85.1 kB]
Get:3 http://localhost:3142/debian sid/main muon-meson 0.3.0-3 (tar) [689 kB]
Get:4 http://localhost:3142/debian sid/main muon-meson 0.3.0-3 (diff) [12.4 kB]
Fetched 788 kB in 0s (3902 kB/s)
Download complete and in download only mode
I: NOTICE: Log filtering will replace 'build/muon-meson-DqWON5/muon-meson-0.3.0' with '<<PKGBUILDDIR>>'
I: NOTICE: Log filtering will replace 'build/muon-meson-DqWON5' with '<<BUILDDIR>>'

+------------------------------------------------------------------------------+
| Install package build dependencies                                           |
+------------------------------------------------------------------------------+


Setup apt archive
-----------------

Merged Build-Depends: debhelper-compat (= 13), dpkg-build-api (= 1), libc-dev, libstdc++-dev, build-essential:amd64, fakeroot:amd64, crossbuild-essential-s390x:amd64, libc-dev:s390x, libstdc++-dev:s390x, libarchive-dev, libcurl4-openssl-dev | libcurl-dev, libpkgconf-dev, ninja-build, pkg-config, python3-yaml:amd64, python3:amd64, scdoc
Filtered Build-Depends: debhelper-compat (= 13), dpkg-build-api (= 1), libc-dev, libstdc++-dev, build-essential:amd64, fakeroot:amd64, crossbuild-essential-s390x:amd64, libc-dev:s390x, libstdc++-dev:s390x, libarchive-dev, libcurl4-openssl-dev, libpkgconf-dev, ninja-build, pkg-config, python3-yaml:amd64, python3:amd64, scdoc
dpkg-deb: building package 'sbuild-build-depends-main-dummy' in '/<<RESOLVERDIR>>/apt_archive/sbuild-build-depends-main-dummy.deb'.
Ign:1 copy:/<<RESOLVERDIR>>/apt_archive ./ InRelease
Get:2 copy:/<<RESOLVERDIR>>/apt_archive ./ Release [609 B]
Ign:3 copy:/<<RESOLVERDIR>>/apt_archive ./ Release.gpg
Get:4 copy:/<<RESOLVERDIR>>/apt_archive ./ Sources [946 B]
Get:5 copy:/<<RESOLVERDIR>>/apt_archive ./ Packages [900 B]
Fetched 2455 B in 0s (0 B/s)
Reading package lists...
Reading package lists...

Install main build dependencies (apt-based resolver)
----------------------------------------------------

Installing build dependencies
Reading package lists...
Building dependency tree...
Reading state information...
Execute external solver...
The following packages were automatically installed and are no longer required:
  login mount
Use 'apt autoremove' to remove them.
The following additional packages will be installed:
  autoconf automake autopoint autotools-dev binutils-s390x-linux-gnu
  bsdextrautils comerr-dev:s390x cpp-14-s390x-linux-gnu cpp-s390x-linux-gnu
  cross-config crossbuild-essential-s390x debhelper dh-autoreconf
  dh-strip-nondeterminism dpkg-cross dwz fakeroot file g++-14-s390x-linux-gnu
  g++-s390x-linux-gnu gcc-14-base:s390x gcc-14-cross-base
  gcc-14-s390x-linux-gnu gcc-14-s390x-linux-gnu-base gcc-s390x-linux-gnu
  gettext gettext-base groff-base icu-devtools intltool-debian libacl1:s390x
  libacl1-dev:s390x libarchive-dev:s390x libarchive-zip-perl
  libarchive13t64:s390x libasan8:s390x libasan8-s390x-cross libatomic1:s390x
  libatomic1-s390x-cross libattr1:s390x libattr1-dev:s390x libbrotli-dev:s390x
  libbrotli1:s390x libbz2-1.0:s390x libbz2-dev:s390x libc6:s390x
  libc6-dev:s390x libc6-dev-s390x-cross libc6-s390x-cross libcom-err2
  libcom-err2:s390x libconfig-auto-perl libconfig-inifiles-perl
  libcrypt-dev:s390x libcrypt1:s390x libcurl4-openssl-dev:s390x
  libcurl4t64:s390x libdb5.3t64:s390x libdebhelper-perl
  libdebian-dpkgcross-perl libelf1t64 libevent-2.1-7t64:s390x libexpat1
  libext2fs-dev:s390x libext2fs2t64:s390x libfakeroot libffi8:s390x
  libfile-homedir-perl libfile-stripnondeterminism-perl libfile-which-perl
  libgcc-14-dev:s390x libgcc-14-dev-s390x-cross libgcc-s1:s390x
  libgcc-s1-s390x-cross libgmp-dev:s390x libgmp10:s390x libgmpxx4ldbl:s390x
  libgnutls-dane0t64:s390x libgnutls-openssl27t64:s390x libgnutls28-dev:s390x
  libgnutls30t64:s390x libgomp1:s390x libgomp1-s390x-cross libgssapi-krb5-2
  libgssapi-krb5-2:s390x libhogweed6t64:s390x libicu-dev:s390x libicu72
  libicu72:s390x libidn2-0:s390x libidn2-dev:s390x libio-string-perl
  libitm1:s390x libitm1-s390x-cross libk5crypto3 libk5crypto3:s390x
  libkeyutils1 libkeyutils1:s390x libkrb5-3 libkrb5-3:s390x libkrb5support0
  libkrb5support0:s390x libldap-2.5-0:s390x liblocale-gettext-perl
  liblz4-1:s390x liblz4-dev:s390x liblzma-dev:s390x liblzma5:s390x
  libmagic-mgc libmagic1t64 libncursesw6 libnettle8t64:s390x
  libnghttp2-14:s390x libnghttp2-dev:s390x libnsl2 libp11-kit-dev:s390x
  libp11-kit0:s390x libpipeline1 libpkgconf-dev:s390x libpkgconf3
  libpkgconf3:s390x libpsl-dev:s390x libpsl5t64:s390x libpython3-stdlib
  libpython3.12-minimal libpython3.12-stdlib libreadline8t64 librtmp-dev:s390x
  librtmp1:s390x libsasl2-2:s390x libsasl2-modules-db:s390x libsqlite3-0
  libssh2-1-dev:s390x libssh2-1t64:s390x libssl-dev:s390x libssl3t64:s390x
  libstdc++-14-dev:s390x libstdc++-14-dev-s390x-cross libstdc++6:s390x
  libstdc++6-s390x-cross libtasn1-6:s390x libtasn1-6-dev:s390x libtirpc-common
  libtirpc3t64 libtool libubsan1:s390x libubsan1-s390x-cross libuchardet0
  libunbound8:s390x libunistring5:s390x libxml-libxml-perl
  libxml-namespacesupport-perl libxml-sax-base-perl libxml-sax-perl
  libxml-simple-perl libxml2 libxml2:s390x libxml2-dev:s390x libxxhash0:s390x
  libyaml-0-2 libyaml-perl libzstd-dev:s390x libzstd1:s390x
  linux-libc-dev-s390x-cross m4 man-db media-types netbase nettle-dev:s390x
  ninja-build pkgconf:s390x pkgconf-bin po-debconf python3 python3-minimal
  python3-yaml python3.12 python3.12-minimal readline-common scdoc
  sensible-utils ucf zlib1g:s390x zlib1g-dev:s390x
Suggested packages:
  autoconf-archive gnu-standards autoconf-doc binutils-doc doc-base:s390x
  gcc-14-locales cpp-14-doc cpp-doc dh-make binutils-multiarch gcc-14-doc
  manpages-dev flex bison gdb-s390x-linux-gnu gcc-doc gettext-doc
  libasprintf-dev libgettextpo-dev groff lrzip:s390x glibc-doc:s390x
  libc-l10n:s390x locales:s390x libnss-nis:s390x libnss-nisplus:s390x
  manpages-dev:s390x libcurl4-doc:s390x libidn-dev:s390x libkrb5-dev:s390x
  libldap2-dev:s390x gmp-doc:s390x libgmp10-doc:s390x libmpfr-dev:s390x
  dns-root-data:s390x gnutls-bin:s390x gnutls-doc:s390x krb5-doc krb5-user
  krb5-doc:s390x krb5-user:s390x icu-doc:s390x liblzma-doc:s390x
  libnghttp2-doc:s390x p11-kit-doc:s390x libssl-doc:s390x
  libstdc++-14-doc:s390x libtool-doc gfortran | fortran95-compiler gcj-jdk
  libyaml-shell-perl m4-doc apparmor less www-browser libmail-box-perl
  python3-doc python3-tk python3-venv python3.12-venv python3.12-doc
  binfmt-support readline-doc
Recommended packages:
  curl | wget | lynx bzip2-doc:s390x ca-certificates:s390x
  libarchive-cpio-perl krb5-locales krb5-locales:s390x libldap-common:s390x
  libgpm2 publicsuffix:s390x libsasl2-modules:s390x libtasn1-doc:s390x
  libltdl-dev libwww-perl libxml-sax-expat-perl libyaml-libyaml-perl
  | libyaml-syck-perl libmail-sendmail-perl ca-certificates
The following NEW packages will be installed:
  autoconf automake autopoint autotools-dev binutils-s390x-linux-gnu
  bsdextrautils comerr-dev:s390x cpp-14-s390x-linux-gnu cpp-s390x-linux-gnu
  cross-config crossbuild-essential-s390x debhelper dh-autoreconf
  dh-strip-nondeterminism dpkg-cross dwz fakeroot file g++-14-s390x-linux-gnu
  g++-s390x-linux-gnu gcc-14-base:s390x gcc-14-cross-base
  gcc-14-s390x-linux-gnu gcc-14-s390x-linux-gnu-base gcc-s390x-linux-gnu
  gettext gettext-base groff-base icu-devtools intltool-debian libacl1:s390x
  libacl1-dev:s390x libarchive-dev:s390x libarchive-zip-perl
  libarchive13t64:s390x libasan8:s390x libasan8-s390x-cross libatomic1:s390x
  libatomic1-s390x-cross libattr1:s390x libattr1-dev:s390x libbrotli-dev:s390x
  libbrotli1:s390x libbz2-1.0:s390x libbz2-dev:s390x libc6:s390x
  libc6-dev:s390x libc6-dev-s390x-cross libc6-s390x-cross libcom-err2
  libcom-err2:s390x libconfig-auto-perl libconfig-inifiles-perl
  libcrypt-dev:s390x libcrypt1:s390x libcurl4-openssl-dev:s390x
  libcurl4t64:s390x libdb5.3t64:s390x libdebhelper-perl
  libdebian-dpkgcross-perl libelf1t64 libevent-2.1-7t64:s390x libexpat1
  libext2fs-dev:s390x libext2fs2t64:s390x libfakeroot libffi8:s390x
  libfile-homedir-perl libfile-stripnondeterminism-perl libfile-which-perl
  libgcc-14-dev:s390x libgcc-14-dev-s390x-cross libgcc-s1:s390x
  libgcc-s1-s390x-cross libgmp-dev:s390x libgmp10:s390x libgmpxx4ldbl:s390x
  libgnutls-dane0t64:s390x libgnutls-openssl27t64:s390x libgnutls28-dev:s390x
  libgnutls30t64:s390x libgomp1:s390x libgomp1-s390x-cross libgssapi-krb5-2
  libgssapi-krb5-2:s390x libhogweed6t64:s390x libicu-dev:s390x libicu72
  libicu72:s390x libidn2-0:s390x libidn2-dev:s390x libio-string-perl
  libitm1:s390x libitm1-s390x-cross libk5crypto3 libk5crypto3:s390x
  libkeyutils1 libkeyutils1:s390x libkrb5-3 libkrb5-3:s390x libkrb5support0
  libkrb5support0:s390x libldap-2.5-0:s390x liblocale-gettext-perl
  liblz4-1:s390x liblz4-dev:s390x liblzma-dev:s390x liblzma5:s390x
  libmagic-mgc libmagic1t64 libncursesw6 libnettle8t64:s390x
  libnghttp2-14:s390x libnghttp2-dev:s390x libnsl2 libp11-kit-dev:s390x
  libp11-kit0:s390x libpipeline1 libpkgconf-dev:s390x libpkgconf3
  libpkgconf3:s390x libpsl-dev:s390x libpsl5t64:s390x libpython3-stdlib
  libpython3.12-minimal libpython3.12-stdlib libreadline8t64 librtmp-dev:s390x
  librtmp1:s390x libsasl2-2:s390x libsasl2-modules-db:s390x libsqlite3-0
  libssh2-1-dev:s390x libssh2-1t64:s390x libssl-dev:s390x libssl3t64:s390x
  libstdc++-14-dev:s390x libstdc++-14-dev-s390x-cross libstdc++6:s390x
  libstdc++6-s390x-cross libtasn1-6:s390x libtasn1-6-dev:s390x libtirpc-common
  libtirpc3t64 libtool libubsan1:s390x libubsan1-s390x-cross libuchardet0
  libunbound8:s390x libunistring5:s390x libxml-libxml-perl
  libxml-namespacesupport-perl libxml-sax-base-perl libxml-sax-perl
  libxml-simple-perl libxml2 libxml2:s390x libxml2-dev:s390x libxxhash0:s390x
  libyaml-0-2 libyaml-perl libzstd-dev:s390x libzstd1:s390x
  linux-libc-dev-s390x-cross m4 man-db media-types netbase nettle-dev:s390x
  ninja-build pkgconf:s390x pkgconf-bin po-debconf python3 python3-minimal
  python3-yaml python3.12 python3.12-minimal readline-common
  sbuild-build-depends-main-dummy:s390x scdoc sensible-utils ucf zlib1g:s390x
  zlib1g-dev:s390x
0 upgraded, 185 newly installed, 0 to remove and 0 not upgraded.
Need to get 137 MB of archives.
After this operation, 531 MB of additional disk space will be used.
Get:1 copy:/<<RESOLVERDIR>>/apt_archive ./ sbuild-build-depends-main-dummy 0.invalid.0 [984 B]
Get:2 http://localhost:3142/debian sid/main amd64 liblocale-gettext-perl amd64 1.07-7 [15.0 kB]
Get:3 http://localhost:3142/debian sid/main amd64 libpython3.12-minimal amd64 3.12.7-1 [814 kB]
Get:4 http://localhost:3142/debian sid/main amd64 libexpat1 amd64 2.6.3-1 [105 kB]
Get:5 http://localhost:3142/debian sid/main amd64 python3.12-minimal amd64 3.12.7-1 [2162 kB]
Get:6 http://localhost:3142/debian sid/main amd64 python3-minimal amd64 3.12.6-1 [26.7 kB]
Get:7 http://localhost:3142/debian sid/main amd64 media-types all 10.1.0 [26.9 kB]
Get:8 http://localhost:3142/debian sid/main amd64 netbase all 6.4 [12.8 kB]
Get:9 http://localhost:3142/debian sid/main amd64 libncursesw6 amd64 6.5-2 [135 kB]
Get:10 http://localhost:3142/debian sid/main amd64 libkrb5support0 amd64 1.21.3-3 [32.5 kB]
Get:11 http://localhost:3142/debian sid/main amd64 libcom-err2 amd64 1.47.1-1 [22.9 kB]
Get:12 http://localhost:3142/debian sid/main amd64 libk5crypto3 amd64 1.21.3-3 [79.9 kB]
Get:13 http://localhost:3142/debian sid/main amd64 libkeyutils1 amd64 1.6.3-3 [8952 B]
Get:14 http://localhost:3142/debian sid/main amd64 libkrb5-3 amd64 1.21.3-3 [324 kB]
Get:15 http://localhost:3142/debian sid/main amd64 libgssapi-krb5-2 amd64 1.21.3-3 [136 kB]
Get:16 http://localhost:3142/debian sid/main amd64 libtirpc-common all 1.3.4+ds-1.3 [10.9 kB]
Get:17 http://localhost:3142/debian sid/main amd64 libtirpc3t64 amd64 1.3.4+ds-1.3 [82.7 kB]
Get:18 http://localhost:3142/debian sid/main amd64 libnsl2 amd64 1.3.0-3+b2 [40.3 kB]
Get:19 http://localhost:3142/debian sid/main amd64 readline-common all 8.2-5 [69.3 kB]
Get:20 http://localhost:3142/debian sid/main amd64 libreadline8t64 amd64 8.2-5 [169 kB]
Get:21 http://localhost:3142/debian sid/main amd64 libsqlite3-0 amd64 3.46.1-1 [913 kB]
Get:22 http://localhost:3142/debian sid/main amd64 libpython3.12-stdlib amd64 3.12.7-1 [1965 kB]
Get:23 http://localhost:3142/debian sid/main amd64 python3.12 amd64 3.12.7-1 [671 kB]
Get:24 http://localhost:3142/debian sid/main amd64 libpython3-stdlib amd64 3.12.6-1 [9692 B]
Get:25 http://localhost:3142/debian sid/main amd64 python3 amd64 3.12.6-1 [27.8 kB]
Get:26 http://localhost:3142/debian sid/main amd64 sensible-utils all 0.0.24 [24.8 kB]
Get:27 http://localhost:3142/debian sid/main amd64 libmagic-mgc amd64 1:5.45-3 [314 kB]
Get:28 http://localhost:3142/debian sid/main amd64 libmagic1t64 amd64 1:5.45-3 [105 kB]
Get:29 http://localhost:3142/debian sid/main amd64 file amd64 1:5.45-3 [42.9 kB]
Get:30 http://localhost:3142/debian sid/main amd64 gettext-base amd64 0.22.5-2 [200 kB]
Get:31 http://localhost:3142/debian sid/main amd64 libuchardet0 amd64 0.0.8-1+b1 [68.8 kB]
Get:32 http://localhost:3142/debian sid/main amd64 groff-base amd64 1.23.0-5 [1181 kB]
Get:33 http://localhost:3142/debian sid/main amd64 bsdextrautils amd64 2.40.2-9 [97.2 kB]
Get:34 http://localhost:3142/debian sid/main amd64 libpipeline1 amd64 1.5.8-1 [42.0 kB]
Get:35 http://localhost:3142/debian sid/main amd64 man-db amd64 2.13.0-1 [1420 kB]
Get:36 http://localhost:3142/debian sid/main amd64 ucf all 3.0043+nmu1 [55.2 kB]
Get:37 http://localhost:3142/debian sid/main amd64 m4 amd64 1.4.19-4 [287 kB]
Get:38 http://localhost:3142/debian sid/main amd64 autoconf all 2.72-3 [493 kB]
Get:39 http://localhost:3142/debian sid/main amd64 autotools-dev all 20220109.1 [51.6 kB]
Get:40 http://localhost:3142/debian sid/main amd64 automake all 1:1.16.5-1.3 [823 kB]
Get:41 http://localhost:3142/debian sid/main amd64 autopoint all 0.22.5-2 [723 kB]
Get:42 http://localhost:3142/debian sid/main amd64 binutils-s390x-linux-gnu amd64 2.43.1-5 [2502 kB]
Get:43 http://localhost:3142/debian sid/main s390x gcc-14-base s390x 14.2.0-6 [46.7 kB]
Get:44 http://localhost:3142/debian sid/main s390x libgcc-s1 s390x 14.2.0-6 [31.9 kB]
Get:45 http://localhost:3142/debian sid/main s390x libc6 s390x 2.40-3 [2410 kB]
Get:46 http://localhost:3142/debian sid/main s390x libcrypt1 s390x 1:4.4.36-5 [93.9 kB]
Get:47 http://localhost:3142/debian sid/main s390x libcrypt-dev s390x 1:4.4.36-5 [122 kB]
Get:48 http://localhost:3142/debian sid/main s390x libc6-dev s390x 2.40-3 [1526 kB]
Get:49 http://localhost:3142/debian sid/main s390x libcom-err2 s390x 1.47.1-1 [22.7 kB]
Get:50 http://localhost:3142/debian sid/main s390x comerr-dev s390x 2.1-1.47.1-1 [54.4 kB]
Get:51 http://localhost:3142/debian sid/main amd64 gcc-14-s390x-linux-gnu-base amd64 14.2.0-6cross1 [46.9 kB]
Get:52 http://localhost:3142/debian sid/main amd64 cpp-14-s390x-linux-gnu amd64 14.2.0-6cross1 [9404 kB]
Get:53 http://localhost:3142/debian sid/main amd64 cpp-s390x-linux-gnu amd64 4:14.1.0-2 [4796 B]
Get:54 http://localhost:3142/debian sid/main amd64 cross-config all 2.6.20 [16.3 kB]
Get:55 http://localhost:3142/debian sid/main amd64 gcc-14-cross-base all 14.2.0-6cross1 [42.2 kB]
Get:56 http://localhost:3142/debian sid/main amd64 libc6-s390x-cross all 2.40-3cross1 [1139 kB]
Get:57 http://localhost:3142/debian sid/main amd64 libgcc-s1-s390x-cross all 14.2.0-6cross1 [31.9 kB]
Get:58 http://localhost:3142/debian sid/main amd64 libgomp1-s390x-cross all 14.2.0-6cross1 [129 kB]
Get:59 http://localhost:3142/debian sid/main amd64 libitm1-s390x-cross all 14.2.0-6cross1 [26.4 kB]
Get:60 http://localhost:3142/debian sid/main amd64 libatomic1-s390x-cross all 14.2.0-6cross1 [8272 B]
Get:61 http://localhost:3142/debian sid/main amd64 libasan8-s390x-cross all 14.2.0-6cross1 [2564 kB]
Get:62 http://localhost:3142/debian sid/main amd64 libstdc++6-s390x-cross all 14.2.0-6cross1 [715 kB]
Get:63 http://localhost:3142/debian sid/main amd64 libubsan1-s390x-cross all 14.2.0-6cross1 [1055 kB]
Get:64 http://localhost:3142/debian sid/main amd64 libgcc-14-dev-s390x-cross all 14.2.0-6cross1 [877 kB]
Get:65 http://localhost:3142/debian sid/main amd64 gcc-14-s390x-linux-gnu amd64 14.2.0-6cross1 [17.8 MB]
Get:66 http://localhost:3142/debian sid/main amd64 gcc-s390x-linux-gnu amd64 4:14.1.0-2 [1444 B]
Get:67 http://localhost:3142/debian sid/main amd64 linux-libc-dev-s390x-cross all 6.11.2-1cross1 [2262 kB]
Get:68 http://localhost:3142/debian sid/main amd64 libc6-dev-s390x-cross all 2.40-3cross1 [1521 kB]
Get:69 http://localhost:3142/debian sid/main amd64 libstdc++-14-dev-s390x-cross all 14.2.0-6cross1 [2377 kB]
Get:70 http://localhost:3142/debian sid/main amd64 g++-14-s390x-linux-gnu amd64 14.2.0-6cross1 [10.4 MB]
Get:71 http://localhost:3142/debian sid/main amd64 g++-s390x-linux-gnu amd64 4:14.1.0-2 [1200 B]
Get:72 http://localhost:3142/debian sid/main amd64 libconfig-inifiles-perl all 3.000003-3 [44.8 kB]
Get:73 http://localhost:3142/debian sid/main amd64 libio-string-perl all 1.08-4 [12.1 kB]
Get:74 http://localhost:3142/debian sid/main amd64 libicu72 amd64 72.1-5 [9396 kB]
Get:75 http://localhost:3142/debian sid/main amd64 libxml2 amd64 2.12.7+dfsg+really2.9.14-0.1 [699 kB]
Get:76 http://localhost:3142/debian sid/main amd64 libxml-namespacesupport-perl all 1.12-2 [15.1 kB]
Get:77 http://localhost:3142/debian sid/main amd64 libxml-sax-base-perl all 1.09-3 [20.6 kB]
Get:78 http://localhost:3142/debian sid/main amd64 libxml-sax-perl all 1.02+dfsg-3 [59.4 kB]
Get:79 http://localhost:3142/debian sid/main amd64 libxml-libxml-perl amd64 2.0207+dfsg+really+2.0134-5 [314 kB]
Get:80 http://localhost:3142/debian sid/main amd64 libxml-simple-perl all 2.25-2 [69.8 kB]
Get:81 http://localhost:3142/debian sid/main amd64 libyaml-perl all 1.31-1 [64.8 kB]
Get:82 http://localhost:3142/debian sid/main amd64 libconfig-auto-perl all 0.44-2 [19.2 kB]
Get:83 http://localhost:3142/debian sid/main amd64 libfile-which-perl all 1.27-2 [15.1 kB]
Get:84 http://localhost:3142/debian sid/main amd64 libfile-homedir-perl all 1.006-2 [42.4 kB]
Get:85 http://localhost:3142/debian sid/main amd64 libdebian-dpkgcross-perl all 2.6.20 [15.3 kB]
Get:86 http://localhost:3142/debian sid/main amd64 dpkg-cross all 2.6.20 [25.8 kB]
Get:87 http://localhost:3142/debian sid/main amd64 crossbuild-essential-s390x all 12.10 [3480 B]
Get:88 http://localhost:3142/debian sid/main amd64 libdebhelper-perl all 13.20 [89.7 kB]
Get:89 http://localhost:3142/debian sid/main amd64 libtool all 2.4.7-7 [517 kB]
Get:90 http://localhost:3142/debian sid/main amd64 dh-autoreconf all 20 [17.1 kB]
Get:91 http://localhost:3142/debian sid/main amd64 libarchive-zip-perl all 1.68-1 [104 kB]
Get:92 http://localhost:3142/debian sid/main amd64 libfile-stripnondeterminism-perl all 1.14.0-1 [19.5 kB]
Get:93 http://localhost:3142/debian sid/main amd64 dh-strip-nondeterminism all 1.14.0-1 [8448 B]
Get:94 http://localhost:3142/debian sid/main amd64 libelf1t64 amd64 0.191-2 [188 kB]
Get:95 http://localhost:3142/debian sid/main amd64 dwz amd64 0.15-1+b1 [110 kB]
Get:96 http://localhost:3142/debian sid/main amd64 gettext amd64 0.22.5-2 [1601 kB]
Get:97 http://localhost:3142/debian sid/main amd64 intltool-debian all 0.35.0+20060710.6 [22.9 kB]
Get:98 http://localhost:3142/debian sid/main amd64 po-debconf all 1.0.21+nmu1 [248 kB]
Get:99 http://localhost:3142/debian sid/main amd64 debhelper all 13.20 [915 kB]
Get:100 http://localhost:3142/debian sid/main amd64 libfakeroot amd64 1.36-1 [29.1 kB]
Get:101 http://localhost:3142/debian sid/main amd64 fakeroot amd64 1.36-1 [75.1 kB]
Get:102 http://localhost:3142/debian sid/main amd64 icu-devtools amd64 72.1-5 [207 kB]
Get:103 http://localhost:3142/debian sid/main s390x libacl1 s390x 2.3.2-2 [32.2 kB]
Get:104 http://localhost:3142/debian sid/main s390x libattr1 s390x 1:2.5.2-1 [22.2 kB]
Get:105 http://localhost:3142/debian sid/main s390x libattr1-dev s390x 1:2.5.2-1 [35.8 kB]
Get:106 http://localhost:3142/debian sid/main s390x libacl1-dev s390x 2.3.2-2 [93.4 kB]
Get:107 http://localhost:3142/debian sid/main s390x libbz2-1.0 s390x 1.0.8-6 [42.3 kB]
Get:108 http://localhost:3142/debian sid/main s390x libxxhash0 s390x 0.8.2-2+b1 [24.1 kB]
Get:109 http://localhost:3142/debian sid/main s390x liblz4-1 s390x 1.9.4-3 [72.2 kB]
Get:110 http://localhost:3142/debian sid/main s390x liblzma5 s390x 5.6.2-2 [255 kB]
Get:111 http://localhost:3142/debian sid/main s390x libnettle8t64 s390x 3.10-1 [318 kB]
Get:112 http://localhost:3142/debian sid/main s390x libstdc++6 s390x 14.2.0-6 [763 kB]
Get:113 http://localhost:3142/debian sid/main s390x libicu72 s390x 72.1-5 [9211 kB]
Get:114 http://localhost:3142/debian sid/main s390x zlib1g s390x 1:1.3.dfsg+really1.3.1-1 [86.1 kB]
Get:115 http://localhost:3142/debian sid/main s390x libxml2 s390x 2.12.7+dfsg+really2.9.14-0.1 [671 kB]
Get:116 http://localhost:3142/debian sid/main s390x libzstd1 s390x 1.5.6+dfsg-1 [329 kB]
Get:117 http://localhost:3142/debian sid/main s390x libarchive13t64 s390x 3.7.4-1 [348 kB]
Get:118 http://localhost:3142/debian sid/main s390x libbz2-dev s390x 1.0.8-6 [35.9 kB]
Get:119 http://localhost:3142/debian sid/main s390x libext2fs2t64 s390x 1.47.1-1 [210 kB]
Get:120 http://localhost:3142/debian sid/main s390x libext2fs-dev s390x 1.47.1-1 [295 kB]
Get:121 http://localhost:3142/debian sid/main s390x liblz4-dev s390x 1.9.4-3 [95.1 kB]
Get:122 http://localhost:3142/debian sid/main s390x liblzma-dev s390x 5.6.2-2 [301 kB]
Get:123 http://localhost:3142/debian sid/main s390x libicu-dev s390x 72.1-5 [10.1 MB]
Get:124 http://localhost:3142/debian sid/main s390x libxml2-dev s390x 2.12.7+dfsg+really2.9.14-0.1 [781 kB]
Get:125 http://localhost:3142/debian sid/main s390x libzstd-dev s390x 1.5.6+dfsg-1 [394 kB]
Get:126 http://localhost:3142/debian sid/main s390x libgmp10 s390x 2:6.3.0+dfsg-2+b1 [602 kB]
Get:127 http://localhost:3142/debian sid/main s390x libhogweed6t64 s390x 3.10-1 [336 kB]
Get:128 http://localhost:3142/debian sid/main s390x libgmpxx4ldbl s390x 2:6.3.0+dfsg-2+b1 [329 kB]
Get:129 http://localhost:3142/debian sid/main s390x libgmp-dev s390x 2:6.3.0+dfsg-2+b1 [684 kB]
Get:130 http://localhost:3142/debian sid/main s390x nettle-dev s390x 3.10-1 [1331 kB]
Get:131 http://localhost:3142/debian sid/main s390x zlib1g-dev s390x 1:1.3.dfsg+really1.3.1-1 [917 kB]
Get:132 http://localhost:3142/debian sid/main s390x libarchive-dev s390x 3.7.4-1 [568 kB]
Get:133 http://localhost:3142/debian sid/main s390x libasan8 s390x 14.2.0-6 [2572 kB]
Get:134 http://localhost:3142/debian sid/main s390x libatomic1 s390x 14.2.0-6 [8580 B]
Get:135 http://localhost:3142/debian sid/main s390x libbrotli1 s390x 1.1.0-2+b4 [323 kB]
Get:136 http://localhost:3142/debian sid/main s390x libbrotli-dev s390x 1.1.0-2+b4 [340 kB]
Get:137 http://localhost:3142/debian sid/main s390x libkrb5support0 s390x 1.21.3-3 [32.7 kB]
Get:138 http://localhost:3142/debian sid/main s390x libk5crypto3 s390x 1.21.3-3 [83.0 kB]
Get:139 http://localhost:3142/debian sid/main s390x libkeyutils1 s390x 1.6.3-3 [8932 B]
Get:140 http://localhost:3142/debian sid/main s390x libssl3t64 s390x 3.3.2-1 [1875 kB]
Get:141 http://localhost:3142/debian sid/main s390x libkrb5-3 s390x 1.21.3-3 [316 kB]
Get:142 http://localhost:3142/debian sid/main s390x libgssapi-krb5-2 s390x 1.21.3-3 [130 kB]
Get:143 http://localhost:3142/debian sid/main s390x libunistring5 s390x 1.2-1 [415 kB]
Get:144 http://localhost:3142/debian sid/main s390x libidn2-0 s390x 2.3.7-2 [126 kB]
Get:145 http://localhost:3142/debian sid/main s390x libffi8 s390x 3.4.6-1 [20.8 kB]
Get:146 http://localhost:3142/debian sid/main s390x libp11-kit0 s390x 0.25.5-2 [427 kB]
Get:147 http://localhost:3142/debian sid/main s390x libtasn1-6 s390x 4.19.0-3+b2 [47.9 kB]
Get:148 http://localhost:3142/debian sid/main s390x libgnutls30t64 s390x 3.8.6-2 [1360 kB]
Get:149 http://localhost:3142/debian sid/main s390x libdb5.3t64 s390x 5.3.28+dfsg2-7 [664 kB]
Get:150 http://localhost:3142/debian sid/main s390x libsasl2-modules-db s390x 2.1.28+dfsg1-8 [19.3 kB]
Get:151 http://localhost:3142/debian sid/main s390x libsasl2-2 s390x 2.1.28+dfsg1-8 [56.8 kB]
Get:152 http://localhost:3142/debian sid/main s390x libldap-2.5-0 s390x 2.5.18+dfsg-3 [182 kB]
Get:153 http://localhost:3142/debian sid/main s390x libnghttp2-14 s390x 1.63.0-1 [73.3 kB]
Get:154 http://localhost:3142/debian sid/main s390x libpsl5t64 s390x 0.21.2-1.1 [56.9 kB]
Get:155 http://localhost:3142/debian sid/main s390x librtmp1 s390x 2.4+20151223.gitfa8646d.1-2+b4 [56.6 kB]
Get:156 http://localhost:3142/debian sid/main s390x libssh2-1t64 s390x 1.11.0-7 [210 kB]
Get:157 http://localhost:3142/debian sid/main s390x libcurl4t64 s390x 8.10.1-1 [339 kB]
Get:158 http://localhost:3142/debian sid/main s390x libidn2-dev s390x 2.3.7-2 [122 kB]
Get:159 http://localhost:3142/debian sid/main amd64 libpkgconf3 amd64 1.8.1-3 [36.2 kB]
Get:160 http://localhost:3142/debian sid/main amd64 pkgconf-bin amd64 1.8.1-3 [29.9 kB]
Get:161 http://localhost:3142/debian sid/main s390x pkgconf s390x 1.8.1-3 [26.1 kB]
Get:162 http://localhost:3142/debian sid/main s390x libnghttp2-dev s390x 1.63.0-1 [114 kB]
Get:163 http://localhost:3142/debian sid/main s390x libpsl-dev s390x 0.21.2-1.1 [77.5 kB]
Get:164 http://localhost:3142/debian sid/main s390x libevent-2.1-7t64 s390x 2.1.12-stable-10 [175 kB]
Get:165 http://localhost:3142/debian sid/main s390x libunbound8 s390x 1.21.1-1 [566 kB]
Get:166 http://localhost:3142/debian sid/main s390x libgnutls-dane0t64 s390x 3.8.6-2 [439 kB]
Get:167 http://localhost:3142/debian sid/main s390x libgnutls-openssl27t64 s390x 3.8.6-2 [439 kB]
Get:168 http://localhost:3142/debian sid/main s390x libp11-kit-dev s390x 0.25.5-2 [208 kB]
Get:169 http://localhost:3142/debian sid/main s390x libtasn1-6-dev s390x 4.19.0-3+b2 [97.8 kB]
Get:170 http://localhost:3142/debian sid/main s390x libgnutls28-dev s390x 3.8.6-2 [1298 kB]
Get:171 http://localhost:3142/debian sid/main s390x librtmp-dev s390x 2.4+20151223.gitfa8646d.1-2+b4 [66.9 kB]
Get:172 http://localhost:3142/debian sid/main s390x libssl-dev s390x 3.3.2-1 [2363 kB]
Get:173 http://localhost:3142/debian sid/main s390x libssh2-1-dev s390x 1.11.0-7 [353 kB]
Get:174 http://localhost:3142/debian sid/main s390x libcurl4-openssl-dev s390x 8.10.1-1 [455 kB]
Get:175 http://localhost:3142/debian sid/main s390x libgomp1 s390x 14.2.0-6 [132 kB]
Get:176 http://localhost:3142/debian sid/main s390x libitm1 s390x 14.2.0-6 [26.9 kB]
Get:177 http://localhost:3142/debian sid/main s390x libubsan1 s390x 14.2.0-6 [1056 kB]
Get:178 http://localhost:3142/debian sid/main s390x libgcc-14-dev s390x 14.2.0-6 [877 kB]
Get:179 http://localhost:3142/debian sid/main s390x libpkgconf3 s390x 1.8.1-3 [34.9 kB]
Get:180 http://localhost:3142/debian sid/main s390x libpkgconf-dev s390x 1.8.1-3 [53.7 kB]
Get:181 http://localhost:3142/debian sid/main s390x libstdc++-14-dev s390x 14.2.0-6 [2399 kB]
Get:182 http://localhost:3142/debian sid/main amd64 libyaml-0-2 amd64 0.2.5-1+b1 [52.6 kB]
Get:183 http://localhost:3142/debian sid/main amd64 ninja-build amd64 1.12.1-1 [142 kB]
Get:184 http://localhost:3142/debian sid/main amd64 python3-yaml amd64 6.0.2-1 [134 kB]
Get:185 http://localhost:3142/debian sid/main amd64 scdoc amd64 1.11.3-1 [14.4 kB]
debconf: delaying package configuration, since apt-utils is not installed
Fetched 137 MB in 1s (129 MB/s)
Selecting previously unselected package liblocale-gettext-perl.
(Reading database ... 12823 files and directories currently installed.)
Preparing to unpack .../liblocale-gettext-perl_1.07-7_amd64.deb ...
Unpacking liblocale-gettext-perl (1.07-7) ...
Selecting previously unselected package libpython3.12-minimal:amd64.
Preparing to unpack .../libpython3.12-minimal_3.12.7-1_amd64.deb ...
Unpacking libpython3.12-minimal:amd64 (3.12.7-1) ...
Selecting previously unselected package libexpat1:amd64.
Preparing to unpack .../libexpat1_2.6.3-1_amd64.deb ...
Unpacking libexpat1:amd64 (2.6.3-1) ...
Selecting previously unselected package python3.12-minimal.
Preparing to unpack .../python3.12-minimal_3.12.7-1_amd64.deb ...
Unpacking python3.12-minimal (3.12.7-1) ...
Setting up libpython3.12-minimal:amd64 (3.12.7-1) ...
Setting up libexpat1:amd64 (2.6.3-1) ...
Setting up python3.12-minimal (3.12.7-1) ...
Selecting previously unselected package python3-minimal.
(Reading database ... 13157 files and directories currently installed.)
Preparing to unpack .../00-python3-minimal_3.12.6-1_amd64.deb ...
Unpacking python3-minimal (3.12.6-1) ...
Selecting previously unselected package media-types.
Preparing to unpack .../01-media-types_10.1.0_all.deb ...
Unpacking media-types (10.1.0) ...
Selecting previously unselected package netbase.
Preparing to unpack .../02-netbase_6.4_all.deb ...
Unpacking netbase (6.4) ...
Selecting previously unselected package libncursesw6:amd64.
Preparing to unpack .../03-libncursesw6_6.5-2_amd64.deb ...
Unpacking libncursesw6:amd64 (6.5-2) ...
Selecting previously unselected package libkrb5support0:amd64.
Preparing to unpack .../04-libkrb5support0_1.21.3-3_amd64.deb ...
Unpacking libkrb5support0:amd64 (1.21.3-3) ...
Selecting previously unselected package libcom-err2:amd64.
Preparing to unpack .../05-libcom-err2_1.47.1-1_amd64.deb ...
Unpacking libcom-err2:amd64 (1.47.1-1) ...
Selecting previously unselected package libk5crypto3:amd64.
Preparing to unpack .../06-libk5crypto3_1.21.3-3_amd64.deb ...
Unpacking libk5crypto3:amd64 (1.21.3-3) ...
Selecting previously unselected package libkeyutils1:amd64.
Preparing to unpack .../07-libkeyutils1_1.6.3-3_amd64.deb ...
Unpacking libkeyutils1:amd64 (1.6.3-3) ...
Selecting previously unselected package libkrb5-3:amd64.
Preparing to unpack .../08-libkrb5-3_1.21.3-3_amd64.deb ...
Unpacking libkrb5-3:amd64 (1.21.3-3) ...
Selecting previously unselected package libgssapi-krb5-2:amd64.
Preparing to unpack .../09-libgssapi-krb5-2_1.21.3-3_amd64.deb ...
Unpacking libgssapi-krb5-2:amd64 (1.21.3-3) ...
Selecting previously unselected package libtirpc-common.
Preparing to unpack .../10-libtirpc-common_1.3.4+ds-1.3_all.deb ...
Unpacking libtirpc-common (1.3.4+ds-1.3) ...
Selecting previously unselected package libtirpc3t64:amd64.
Preparing to unpack .../11-libtirpc3t64_1.3.4+ds-1.3_amd64.deb ...
Adding 'diversion of /lib/x86_64-linux-gnu/libtirpc.so.3 to /lib/x86_64-linux-gnu/libtirpc.so.3.usr-is-merged by libtirpc3t64'
Adding 'diversion of /lib/x86_64-linux-gnu/libtirpc.so.3.0.0 to /lib/x86_64-linux-gnu/libtirpc.so.3.0.0.usr-is-merged by libtirpc3t64'
Unpacking libtirpc3t64:amd64 (1.3.4+ds-1.3) ...
Selecting previously unselected package libnsl2:amd64.
Preparing to unpack .../12-libnsl2_1.3.0-3+b2_amd64.deb ...
Unpacking libnsl2:amd64 (1.3.0-3+b2) ...
Selecting previously unselected package readline-common.
Preparing to unpack .../13-readline-common_8.2-5_all.deb ...
Unpacking readline-common (8.2-5) ...
Selecting previously unselected package libreadline8t64:amd64.
Preparing to unpack .../14-libreadline8t64_8.2-5_amd64.deb ...
Adding 'diversion of /lib/x86_64-linux-gnu/libhistory.so.8 to /lib/x86_64-linux-gnu/libhistory.so.8.usr-is-merged by libreadline8t64'
Adding 'diversion of /lib/x86_64-linux-gnu/libhistory.so.8.2 to /lib/x86_64-linux-gnu/libhistory.so.8.2.usr-is-merged by libreadline8t64'
Adding 'diversion of /lib/x86_64-linux-gnu/libreadline.so.8 to /lib/x86_64-linux-gnu/libreadline.so.8.usr-is-merged by libreadline8t64'
Adding 'diversion of /lib/x86_64-linux-gnu/libreadline.so.8.2 to /lib/x86_64-linux-gnu/libreadline.so.8.2.usr-is-merged by libreadline8t64'
Unpacking libreadline8t64:amd64 (8.2-5) ...
Selecting previously unselected package libsqlite3-0:amd64.
Preparing to unpack .../15-libsqlite3-0_3.46.1-1_amd64.deb ...
Unpacking libsqlite3-0:amd64 (3.46.1-1) ...
Selecting previously unselected package libpython3.12-stdlib:amd64.
Preparing to unpack .../16-libpython3.12-stdlib_3.12.7-1_amd64.deb ...
Unpacking libpython3.12-stdlib:amd64 (3.12.7-1) ...
Selecting previously unselected package python3.12.
Preparing to unpack .../17-python3.12_3.12.7-1_amd64.deb ...
Unpacking python3.12 (3.12.7-1) ...
Selecting previously unselected package libpython3-stdlib:amd64.
Preparing to unpack .../18-libpython3-stdlib_3.12.6-1_amd64.deb ...
Unpacking libpython3-stdlib:amd64 (3.12.6-1) ...
Setting up python3-minimal (3.12.6-1) ...
Selecting previously unselected package python3.
(Reading database ... 13718 files and directories currently installed.)
Preparing to unpack .../000-python3_3.12.6-1_amd64.deb ...
Unpacking python3 (3.12.6-1) ...
Selecting previously unselected package sensible-utils.
Preparing to unpack .../001-sensible-utils_0.0.24_all.deb ...
Unpacking sensible-utils (0.0.24) ...
Selecting previously unselected package libmagic-mgc.
Preparing to unpack .../002-libmagic-mgc_1%3a5.45-3_amd64.deb ...
Unpacking libmagic-mgc (1:5.45-3) ...
Selecting previously unselected package libmagic1t64:amd64.
Preparing to unpack .../003-libmagic1t64_1%3a5.45-3_amd64.deb ...
Unpacking libmagic1t64:amd64 (1:5.45-3) ...
Selecting previously unselected package file.
Preparing to unpack .../004-file_1%3a5.45-3_amd64.deb ...
Unpacking file (1:5.45-3) ...
Selecting previously unselected package gettext-base.
Preparing to unpack .../005-gettext-base_0.22.5-2_amd64.deb ...
Unpacking gettext-base (0.22.5-2) ...
Selecting previously unselected package libuchardet0:amd64.
Preparing to unpack .../006-libuchardet0_0.0.8-1+b1_amd64.deb ...
Unpacking libuchardet0:amd64 (0.0.8-1+b1) ...
Selecting previously unselected package groff-base.
Preparing to unpack .../007-groff-base_1.23.0-5_amd64.deb ...
Unpacking groff-base (1.23.0-5) ...
Selecting previously unselected package bsdextrautils.
Preparing to unpack .../008-bsdextrautils_2.40.2-9_amd64.deb ...
Unpacking bsdextrautils (2.40.2-9) ...
Selecting previously unselected package libpipeline1:amd64.
Preparing to unpack .../009-libpipeline1_1.5.8-1_amd64.deb ...
Unpacking libpipeline1:amd64 (1.5.8-1) ...
Selecting previously unselected package man-db.
Preparing to unpack .../010-man-db_2.13.0-1_amd64.deb ...
Unpacking man-db (2.13.0-1) ...
Selecting previously unselected package ucf.
Preparing to unpack .../011-ucf_3.0043+nmu1_all.deb ...
Moving old data out of the way
Unpacking ucf (3.0043+nmu1) ...
Selecting previously unselected package m4.
Preparing to unpack .../012-m4_1.4.19-4_amd64.deb ...
Unpacking m4 (1.4.19-4) ...
Selecting previously unselected package autoconf.
Preparing to unpack .../013-autoconf_2.72-3_all.deb ...
Unpacking autoconf (2.72-3) ...
Selecting previously unselected package autotools-dev.
Preparing to unpack .../014-autotools-dev_20220109.1_all.deb ...
Unpacking autotools-dev (20220109.1) ...
Selecting previously unselected package automake.
Preparing to unpack .../015-automake_1%3a1.16.5-1.3_all.deb ...
Unpacking automake (1:1.16.5-1.3) ...
Selecting previously unselected package autopoint.
Preparing to unpack .../016-autopoint_0.22.5-2_all.deb ...
Unpacking autopoint (0.22.5-2) ...
Selecting previously unselected package binutils-s390x-linux-gnu.
Preparing to unpack .../017-binutils-s390x-linux-gnu_2.43.1-5_amd64.deb ...
Unpacking binutils-s390x-linux-gnu (2.43.1-5) ...
Selecting previously unselected package gcc-14-base:s390x.
Preparing to unpack .../018-gcc-14-base_14.2.0-6_s390x.deb ...
Unpacking gcc-14-base:s390x (14.2.0-6) ...
Selecting previously unselected package libgcc-s1:s390x.
Preparing to unpack .../019-libgcc-s1_14.2.0-6_s390x.deb ...
Unpacking libgcc-s1:s390x (14.2.0-6) ...
Selecting previously unselected package libc6:s390x.
Preparing to unpack .../020-libc6_2.40-3_s390x.deb ...
Unpacking libc6:s390x (2.40-3) ...
Selecting previously unselected package libcrypt1:s390x.
Preparing to unpack .../021-libcrypt1_1%3a4.4.36-5_s390x.deb ...
Unpacking libcrypt1:s390x (1:4.4.36-5) ...
Selecting previously unselected package libcrypt-dev:s390x.
Preparing to unpack .../022-libcrypt-dev_1%3a4.4.36-5_s390x.deb ...
Unpacking libcrypt-dev:s390x (1:4.4.36-5) ...
Selecting previously unselected package libc6-dev:s390x.
Preparing to unpack .../023-libc6-dev_2.40-3_s390x.deb ...
Unpacking libc6-dev:s390x (2.40-3) ...
Selecting previously unselected package libcom-err2:s390x.
Preparing to unpack .../024-libcom-err2_1.47.1-1_s390x.deb ...
Unpacking libcom-err2:s390x (1.47.1-1) ...
Selecting previously unselected package comerr-dev:s390x.
Preparing to unpack .../025-comerr-dev_2.1-1.47.1-1_s390x.deb ...
Unpacking comerr-dev:s390x (2.1-1.47.1-1) ...
Selecting previously unselected package gcc-14-s390x-linux-gnu-base:amd64.
Preparing to unpack .../026-gcc-14-s390x-linux-gnu-base_14.2.0-6cross1_amd64.deb ...
Unpacking gcc-14-s390x-linux-gnu-base:amd64 (14.2.0-6cross1) ...
Selecting previously unselected package cpp-14-s390x-linux-gnu.
Preparing to unpack .../027-cpp-14-s390x-linux-gnu_14.2.0-6cross1_amd64.deb ...
Unpacking cpp-14-s390x-linux-gnu (14.2.0-6cross1) ...
Selecting previously unselected package cpp-s390x-linux-gnu.
Preparing to unpack .../028-cpp-s390x-linux-gnu_4%3a14.1.0-2_amd64.deb ...
Unpacking cpp-s390x-linux-gnu (4:14.1.0-2) ...
Selecting previously unselected package cross-config.
Preparing to unpack .../029-cross-config_2.6.20_all.deb ...
Unpacking cross-config (2.6.20) ...
Selecting previously unselected package gcc-14-cross-base.
Preparing to unpack .../030-gcc-14-cross-base_14.2.0-6cross1_all.deb ...
Unpacking gcc-14-cross-base (14.2.0-6cross1) ...
Selecting previously unselected package libc6-s390x-cross.
Preparing to unpack .../031-libc6-s390x-cross_2.40-3cross1_all.deb ...
Unpacking libc6-s390x-cross (2.40-3cross1) ...
Selecting previously unselected package libgcc-s1-s390x-cross.
Preparing to unpack .../032-libgcc-s1-s390x-cross_14.2.0-6cross1_all.deb ...
Unpacking libgcc-s1-s390x-cross (14.2.0-6cross1) ...
Selecting previously unselected package libgomp1-s390x-cross.
Preparing to unpack .../033-libgomp1-s390x-cross_14.2.0-6cross1_all.deb ...
Unpacking libgomp1-s390x-cross (14.2.0-6cross1) ...
Selecting previously unselected package libitm1-s390x-cross.
Preparing to unpack .../034-libitm1-s390x-cross_14.2.0-6cross1_all.deb ...
Unpacking libitm1-s390x-cross (14.2.0-6cross1) ...
Selecting previously unselected package libatomic1-s390x-cross.
Preparing to unpack .../035-libatomic1-s390x-cross_14.2.0-6cross1_all.deb ...
Unpacking libatomic1-s390x-cross (14.2.0-6cross1) ...
Selecting previously unselected package libasan8-s390x-cross.
Preparing to unpack .../036-libasan8-s390x-cross_14.2.0-6cross1_all.deb ...
Unpacking libasan8-s390x-cross (14.2.0-6cross1) ...
Selecting previously unselected package libstdc++6-s390x-cross.
Preparing to unpack .../037-libstdc++6-s390x-cross_14.2.0-6cross1_all.deb ...
Unpacking libstdc++6-s390x-cross (14.2.0-6cross1) ...
Selecting previously unselected package libubsan1-s390x-cross.
Preparing to unpack .../038-libubsan1-s390x-cross_14.2.0-6cross1_all.deb ...
Unpacking libubsan1-s390x-cross (14.2.0-6cross1) ...
Selecting previously unselected package libgcc-14-dev-s390x-cross.
Preparing to unpack .../039-libgcc-14-dev-s390x-cross_14.2.0-6cross1_all.deb ...
Unpacking libgcc-14-dev-s390x-cross (14.2.0-6cross1) ...
Selecting previously unselected package gcc-14-s390x-linux-gnu.
Preparing to unpack .../040-gcc-14-s390x-linux-gnu_14.2.0-6cross1_amd64.deb ...
Unpacking gcc-14-s390x-linux-gnu (14.2.0-6cross1) ...
Selecting previously unselected package gcc-s390x-linux-gnu.
Preparing to unpack .../041-gcc-s390x-linux-gnu_4%3a14.1.0-2_amd64.deb ...
Unpacking gcc-s390x-linux-gnu (4:14.1.0-2) ...
Selecting previously unselected package linux-libc-dev-s390x-cross.
Preparing to unpack .../042-linux-libc-dev-s390x-cross_6.11.2-1cross1_all.deb ...
Unpacking linux-libc-dev-s390x-cross (6.11.2-1cross1) ...
Selecting previously unselected package libc6-dev-s390x-cross.
Preparing to unpack .../043-libc6-dev-s390x-cross_2.40-3cross1_all.deb ...
Unpacking libc6-dev-s390x-cross (2.40-3cross1) ...
Selecting previously unselected package libstdc++-14-dev-s390x-cross.
Preparing to unpack .../044-libstdc++-14-dev-s390x-cross_14.2.0-6cross1_all.deb ...
Unpacking libstdc++-14-dev-s390x-cross (14.2.0-6cross1) ...
Selecting previously unselected package g++-14-s390x-linux-gnu.
Preparing to unpack .../045-g++-14-s390x-linux-gnu_14.2.0-6cross1_amd64.deb ...
Unpacking g++-14-s390x-linux-gnu (14.2.0-6cross1) ...
Selecting previously unselected package g++-s390x-linux-gnu.
Preparing to unpack .../046-g++-s390x-linux-gnu_4%3a14.1.0-2_amd64.deb ...
Unpacking g++-s390x-linux-gnu (4:14.1.0-2) ...
Selecting previously unselected package libconfig-inifiles-perl.
Preparing to unpack .../047-libconfig-inifiles-perl_3.000003-3_all.deb ...
Unpacking libconfig-inifiles-perl (3.000003-3) ...
Selecting previously unselected package libio-string-perl.
Preparing to unpack .../048-libio-string-perl_1.08-4_all.deb ...
Unpacking libio-string-perl (1.08-4) ...
Selecting previously unselected package libicu72:amd64.
Preparing to unpack .../049-libicu72_72.1-5_amd64.deb ...
Unpacking libicu72:amd64 (72.1-5) ...
Selecting previously unselected package libxml2:amd64.
Preparing to unpack .../050-libxml2_2.12.7+dfsg+really2.9.14-0.1_amd64.deb ...
Unpacking libxml2:amd64 (2.12.7+dfsg+really2.9.14-0.1) ...
Selecting previously unselected package libxml-namespacesupport-perl.
Preparing to unpack .../051-libxml-namespacesupport-perl_1.12-2_all.deb ...
Unpacking libxml-namespacesupport-perl (1.12-2) ...
Selecting previously unselected package libxml-sax-base-perl.
Preparing to unpack .../052-libxml-sax-base-perl_1.09-3_all.deb ...
Unpacking libxml-sax-base-perl (1.09-3) ...
Selecting previously unselected package libxml-sax-perl.
Preparing to unpack .../053-libxml-sax-perl_1.02+dfsg-3_all.deb ...
Unpacking libxml-sax-perl (1.02+dfsg-3) ...
Selecting previously unselected package libxml-libxml-perl.
Preparing to unpack .../054-libxml-libxml-perl_2.0207+dfsg+really+2.0134-5_amd64.deb ...
Unpacking libxml-libxml-perl (2.0207+dfsg+really+2.0134-5) ...
Selecting previously unselected package libxml-simple-perl.
Preparing to unpack .../055-libxml-simple-perl_2.25-2_all.deb ...
Unpacking libxml-simple-perl (2.25-2) ...
Selecting previously unselected package libyaml-perl.
Preparing to unpack .../056-libyaml-perl_1.31-1_all.deb ...
Unpacking libyaml-perl (1.31-1) ...
Selecting previously unselected package libconfig-auto-perl.
Preparing to unpack .../057-libconfig-auto-perl_0.44-2_all.deb ...
Unpacking libconfig-auto-perl (0.44-2) ...
Selecting previously unselected package libfile-which-perl.
Preparing to unpack .../058-libfile-which-perl_1.27-2_all.deb ...
Unpacking libfile-which-perl (1.27-2) ...
Selecting previously unselected package libfile-homedir-perl.
Preparing to unpack .../059-libfile-homedir-perl_1.006-2_all.deb ...
Unpacking libfile-homedir-perl (1.006-2) ...
Selecting previously unselected package libdebian-dpkgcross-perl.
Preparing to unpack .../060-libdebian-dpkgcross-perl_2.6.20_all.deb ...
Unpacking libdebian-dpkgcross-perl (2.6.20) ...
Selecting previously unselected package dpkg-cross.
Preparing to unpack .../061-dpkg-cross_2.6.20_all.deb ...
Unpacking dpkg-cross (2.6.20) ...
Selecting previously unselected package crossbuild-essential-s390x.
Preparing to unpack .../062-crossbuild-essential-s390x_12.10_all.deb ...
Unpacking crossbuild-essential-s390x (12.10) ...
Selecting previously unselected package libdebhelper-perl.
Preparing to unpack .../063-libdebhelper-perl_13.20_all.deb ...
Unpacking libdebhelper-perl (13.20) ...
Selecting previously unselected package libtool.
Preparing to unpack .../064-libtool_2.4.7-7_all.deb ...
Unpacking libtool (2.4.7-7) ...
Selecting previously unselected package dh-autoreconf.
Preparing to unpack .../065-dh-autoreconf_20_all.deb ...
Unpacking dh-autoreconf (20) ...
Selecting previously unselected package libarchive-zip-perl.
Preparing to unpack .../066-libarchive-zip-perl_1.68-1_all.deb ...
Unpacking libarchive-zip-perl (1.68-1) ...
Selecting previously unselected package libfile-stripnondeterminism-perl.
Preparing to unpack .../067-libfile-stripnondeterminism-perl_1.14.0-1_all.deb ...
Unpacking libfile-stripnondeterminism-perl (1.14.0-1) ...
Selecting previously unselected package dh-strip-nondeterminism.
Preparing to unpack .../068-dh-strip-nondeterminism_1.14.0-1_all.deb ...
Unpacking dh-strip-nondeterminism (1.14.0-1) ...
Selecting previously unselected package libelf1t64:amd64.
Preparing to unpack .../069-libelf1t64_0.191-2_amd64.deb ...
Unpacking libelf1t64:amd64 (0.191-2) ...
Selecting previously unselected package dwz.
Preparing to unpack .../070-dwz_0.15-1+b1_amd64.deb ...
Unpacking dwz (0.15-1+b1) ...
Selecting previously unselected package gettext.
Preparing to unpack .../071-gettext_0.22.5-2_amd64.deb ...
Unpacking gettext (0.22.5-2) ...
Selecting previously unselected package intltool-debian.
Preparing to unpack .../072-intltool-debian_0.35.0+20060710.6_all.deb ...
Unpacking intltool-debian (0.35.0+20060710.6) ...
Selecting previously unselected package po-debconf.
Preparing to unpack .../073-po-debconf_1.0.21+nmu1_all.deb ...
Unpacking po-debconf (1.0.21+nmu1) ...
Selecting previously unselected package debhelper.
Preparing to unpack .../074-debhelper_13.20_all.deb ...
Unpacking debhelper (13.20) ...
Selecting previously unselected package libfakeroot:amd64.
Preparing to unpack .../075-libfakeroot_1.36-1_amd64.deb ...
Unpacking libfakeroot:amd64 (1.36-1) ...
Selecting previously unselected package fakeroot.
Preparing to unpack .../076-fakeroot_1.36-1_amd64.deb ...
Unpacking fakeroot (1.36-1) ...
Selecting previously unselected package icu-devtools.
Preparing to unpack .../077-icu-devtools_72.1-5_amd64.deb ...
Unpacking icu-devtools (72.1-5) ...
Selecting previously unselected package libacl1:s390x.
Preparing to unpack .../078-libacl1_2.3.2-2_s390x.deb ...
Unpacking libacl1:s390x (2.3.2-2) ...
Selecting previously unselected package libattr1:s390x.
Preparing to unpack .../079-libattr1_1%3a2.5.2-1_s390x.deb ...
Unpacking libattr1:s390x (1:2.5.2-1) ...
Selecting previously unselected package libattr1-dev:s390x.
Preparing to unpack .../080-libattr1-dev_1%3a2.5.2-1_s390x.deb ...
Unpacking libattr1-dev:s390x (1:2.5.2-1) ...
Selecting previously unselected package libacl1-dev:s390x.
Preparing to unpack .../081-libacl1-dev_2.3.2-2_s390x.deb ...
Unpacking libacl1-dev:s390x (2.3.2-2) ...
Selecting previously unselected package libbz2-1.0:s390x.
Preparing to unpack .../082-libbz2-1.0_1.0.8-6_s390x.deb ...
Unpacking libbz2-1.0:s390x (1.0.8-6) ...
Selecting previously unselected package libxxhash0:s390x.
Preparing to unpack .../083-libxxhash0_0.8.2-2+b1_s390x.deb ...
Unpacking libxxhash0:s390x (0.8.2-2+b1) ...
Selecting previously unselected package liblz4-1:s390x.
Preparing to unpack .../084-liblz4-1_1.9.4-3_s390x.deb ...
Unpacking liblz4-1:s390x (1.9.4-3) ...
Selecting previously unselected package liblzma5:s390x.
Preparing to unpack .../085-liblzma5_5.6.2-2_s390x.deb ...
Unpacking liblzma5:s390x (5.6.2-2) ...
Selecting previously unselected package libnettle8t64:s390x.
Preparing to unpack .../086-libnettle8t64_3.10-1_s390x.deb ...
Unpacking libnettle8t64:s390x (3.10-1) ...
Selecting previously unselected package libstdc++6:s390x.
Preparing to unpack .../087-libstdc++6_14.2.0-6_s390x.deb ...
Unpacking libstdc++6:s390x (14.2.0-6) ...
Selecting previously unselected package libicu72:s390x.
Preparing to unpack .../088-libicu72_72.1-5_s390x.deb ...
Unpacking libicu72:s390x (72.1-5) ...
Selecting previously unselected package zlib1g:s390x.
Preparing to unpack .../089-zlib1g_1%3a1.3.dfsg+really1.3.1-1_s390x.deb ...
Unpacking zlib1g:s390x (1:1.3.dfsg+really1.3.1-1) ...
Selecting previously unselected package libxml2:s390x.
Preparing to unpack .../090-libxml2_2.12.7+dfsg+really2.9.14-0.1_s390x.deb ...
Unpacking libxml2:s390x (2.12.7+dfsg+really2.9.14-0.1) ...
Selecting previously unselected package libzstd1:s390x.
Preparing to unpack .../091-libzstd1_1.5.6+dfsg-1_s390x.deb ...
Unpacking libzstd1:s390x (1.5.6+dfsg-1) ...
Selecting previously unselected package libarchive13t64:s390x.
Preparing to unpack .../092-libarchive13t64_3.7.4-1_s390x.deb ...
Unpacking libarchive13t64:s390x (3.7.4-1) ...
Selecting previously unselected package libbz2-dev:s390x.
Preparing to unpack .../093-libbz2-dev_1.0.8-6_s390x.deb ...
Unpacking libbz2-dev:s390x (1.0.8-6) ...
Selecting previously unselected package libext2fs2t64:s390x.
Preparing to unpack .../094-libext2fs2t64_1.47.1-1_s390x.deb ...
Adding 'diversion of /lib/s390x-linux-gnu/libe2p.so.2 to /lib/s390x-linux-gnu/libe2p.so.2.usr-is-merged by libext2fs2t64'
Adding 'diversion of /lib/s390x-linux-gnu/libe2p.so.2.3 to /lib/s390x-linux-gnu/libe2p.so.2.3.usr-is-merged by libext2fs2t64'
Adding 'diversion of /lib/s390x-linux-gnu/libext2fs.so.2 to /lib/s390x-linux-gnu/libext2fs.so.2.usr-is-merged by libext2fs2t64'
Adding 'diversion of /lib/s390x-linux-gnu/libext2fs.so.2.4 to /lib/s390x-linux-gnu/libext2fs.so.2.4.usr-is-merged by libext2fs2t64'
Unpacking libext2fs2t64:s390x (1.47.1-1) ...
Selecting previously unselected package libext2fs-dev:s390x.
Preparing to unpack .../095-libext2fs-dev_1.47.1-1_s390x.deb ...
Unpacking libext2fs-dev:s390x (1.47.1-1) ...
Selecting previously unselected package liblz4-dev:s390x.
Preparing to unpack .../096-liblz4-dev_1.9.4-3_s390x.deb ...
Unpacking liblz4-dev:s390x (1.9.4-3) ...
Selecting previously unselected package liblzma-dev:s390x.
Preparing to unpack .../097-liblzma-dev_5.6.2-2_s390x.deb ...
Unpacking liblzma-dev:s390x (5.6.2-2) ...
Selecting previously unselected package libicu-dev:s390x.
Preparing to unpack .../098-libicu-dev_72.1-5_s390x.deb ...
Unpacking libicu-dev:s390x (72.1-5) ...
Selecting previously unselected package libxml2-dev:s390x.
Preparing to unpack .../099-libxml2-dev_2.12.7+dfsg+really2.9.14-0.1_s390x.deb ...
Unpacking libxml2-dev:s390x (2.12.7+dfsg+really2.9.14-0.1) ...
Selecting previously unselected package libzstd-dev:s390x.
Preparing to unpack .../100-libzstd-dev_1.5.6+dfsg-1_s390x.deb ...
Unpacking libzstd-dev:s390x (1.5.6+dfsg-1) ...
Selecting previously unselected package libgmp10:s390x.
Preparing to unpack .../101-libgmp10_2%3a6.3.0+dfsg-2+b1_s390x.deb ...
Unpacking libgmp10:s390x (2:6.3.0+dfsg-2+b1) ...
Selecting previously unselected package libhogweed6t64:s390x.
Preparing to unpack .../102-libhogweed6t64_3.10-1_s390x.deb ...
Unpacking libhogweed6t64:s390x (3.10-1) ...
Selecting previously unselected package libgmpxx4ldbl:s390x.
Preparing to unpack .../103-libgmpxx4ldbl_2%3a6.3.0+dfsg-2+b1_s390x.deb ...
Unpacking libgmpxx4ldbl:s390x (2:6.3.0+dfsg-2+b1) ...
Selecting previously unselected package libgmp-dev:s390x.
Preparing to unpack .../104-libgmp-dev_2%3a6.3.0+dfsg-2+b1_s390x.deb ...
Unpacking libgmp-dev:s390x (2:6.3.0+dfsg-2+b1) ...
Selecting previously unselected package nettle-dev:s390x.
Preparing to unpack .../105-nettle-dev_3.10-1_s390x.deb ...
Unpacking nettle-dev:s390x (3.10-1) ...
Selecting previously unselected package zlib1g-dev:s390x.
Preparing to unpack .../106-zlib1g-dev_1%3a1.3.dfsg+really1.3.1-1_s390x.deb ...
Unpacking zlib1g-dev:s390x (1:1.3.dfsg+really1.3.1-1) ...
Selecting previously unselected package libarchive-dev:s390x.
Preparing to unpack .../107-libarchive-dev_3.7.4-1_s390x.deb ...
Unpacking libarchive-dev:s390x (3.7.4-1) ...
Selecting previously unselected package libasan8:s390x.
Preparing to unpack .../108-libasan8_14.2.0-6_s390x.deb ...
Unpacking libasan8:s390x (14.2.0-6) ...
Selecting previously unselected package libatomic1:s390x.
Preparing to unpack .../109-libatomic1_14.2.0-6_s390x.deb ...
Unpacking libatomic1:s390x (14.2.0-6) ...
Selecting previously unselected package libbrotli1:s390x.
Preparing to unpack .../110-libbrotli1_1.1.0-2+b4_s390x.deb ...
Unpacking libbrotli1:s390x (1.1.0-2+b4) ...
Selecting previously unselected package libbrotli-dev:s390x.
Preparing to unpack .../111-libbrotli-dev_1.1.0-2+b4_s390x.deb ...
Unpacking libbrotli-dev:s390x (1.1.0-2+b4) ...
Selecting previously unselected package libkrb5support0:s390x.
Preparing to unpack .../112-libkrb5support0_1.21.3-3_s390x.deb ...
Unpacking libkrb5support0:s390x (1.21.3-3) ...
Selecting previously unselected package libk5crypto3:s390x.
Preparing to unpack .../113-libk5crypto3_1.21.3-3_s390x.deb ...
Unpacking libk5crypto3:s390x (1.21.3-3) ...
Selecting previously unselected package libkeyutils1:s390x.
Preparing to unpack .../114-libkeyutils1_1.6.3-3_s390x.deb ...
Unpacking libkeyutils1:s390x (1.6.3-3) ...
Selecting previously unselected package libssl3t64:s390x.
Preparing to unpack .../115-libssl3t64_3.3.2-1_s390x.deb ...
Unpacking libssl3t64:s390x (3.3.2-1) ...
Selecting previously unselected package libkrb5-3:s390x.
Preparing to unpack .../116-libkrb5-3_1.21.3-3_s390x.deb ...
Unpacking libkrb5-3:s390x (1.21.3-3) ...
Selecting previously unselected package libgssapi-krb5-2:s390x.
Preparing to unpack .../117-libgssapi-krb5-2_1.21.3-3_s390x.deb ...
Unpacking libgssapi-krb5-2:s390x (1.21.3-3) ...
Selecting previously unselected package libunistring5:s390x.
Preparing to unpack .../118-libunistring5_1.2-1_s390x.deb ...
Unpacking libunistring5:s390x (1.2-1) ...
Selecting previously unselected package libidn2-0:s390x.
Preparing to unpack .../119-libidn2-0_2.3.7-2_s390x.deb ...
Unpacking libidn2-0:s390x (2.3.7-2) ...
Selecting previously unselected package libffi8:s390x.
Preparing to unpack .../120-libffi8_3.4.6-1_s390x.deb ...
Unpacking libffi8:s390x (3.4.6-1) ...
Selecting previously unselected package libp11-kit0:s390x.
Preparing to unpack .../121-libp11-kit0_0.25.5-2_s390x.deb ...
Unpacking libp11-kit0:s390x (0.25.5-2) ...
Selecting previously unselected package libtasn1-6:s390x.
Preparing to unpack .../122-libtasn1-6_4.19.0-3+b2_s390x.deb ...
Unpacking libtasn1-6:s390x (4.19.0-3+b2) ...
Selecting previously unselected package libgnutls30t64:s390x.
Preparing to unpack .../123-libgnutls30t64_3.8.6-2_s390x.deb ...
Unpacking libgnutls30t64:s390x (3.8.6-2) ...
Selecting previously unselected package libdb5.3t64:s390x.
Preparing to unpack .../124-libdb5.3t64_5.3.28+dfsg2-7_s390x.deb ...
Unpacking libdb5.3t64:s390x (5.3.28+dfsg2-7) ...
Selecting previously unselected package libsasl2-modules-db:s390x.
Preparing to unpack .../125-libsasl2-modules-db_2.1.28+dfsg1-8_s390x.deb ...
Unpacking libsasl2-modules-db:s390x (2.1.28+dfsg1-8) ...
Selecting previously unselected package libsasl2-2:s390x.
Preparing to unpack .../126-libsasl2-2_2.1.28+dfsg1-8_s390x.deb ...
Unpacking libsasl2-2:s390x (2.1.28+dfsg1-8) ...
Selecting previously unselected package libldap-2.5-0:s390x.
Preparing to unpack .../127-libldap-2.5-0_2.5.18+dfsg-3_s390x.deb ...
Unpacking libldap-2.5-0:s390x (2.5.18+dfsg-3) ...
Selecting previously unselected package libnghttp2-14:s390x.
Preparing to unpack .../128-libnghttp2-14_1.63.0-1_s390x.deb ...
Unpacking libnghttp2-14:s390x (1.63.0-1) ...
Selecting previously unselected package libpsl5t64:s390x.
Preparing to unpack .../129-libpsl5t64_0.21.2-1.1_s390x.deb ...
Unpacking libpsl5t64:s390x (0.21.2-1.1) ...
Selecting previously unselected package librtmp1:s390x.
Preparing to unpack .../130-librtmp1_2.4+20151223.gitfa8646d.1-2+b4_s390x.deb ...
Unpacking librtmp1:s390x (2.4+20151223.gitfa8646d.1-2+b4) ...
Selecting previously unselected package libssh2-1t64:s390x.
Preparing to unpack .../131-libssh2-1t64_1.11.0-7_s390x.deb ...
Unpacking libssh2-1t64:s390x (1.11.0-7) ...
Selecting previously unselected package libcurl4t64:s390x.
Preparing to unpack .../132-libcurl4t64_8.10.1-1_s390x.deb ...
Unpacking libcurl4t64:s390x (8.10.1-1) ...
Selecting previously unselected package libidn2-dev:s390x.
Preparing to unpack .../133-libidn2-dev_2.3.7-2_s390x.deb ...
Unpacking libidn2-dev:s390x (2.3.7-2) ...
Selecting previously unselected package libpkgconf3:amd64.
Preparing to unpack .../134-libpkgconf3_1.8.1-3_amd64.deb ...
Unpacking libpkgconf3:amd64 (1.8.1-3) ...
Selecting previously unselected package pkgconf-bin.
Preparing to unpack .../135-pkgconf-bin_1.8.1-3_amd64.deb ...
Unpacking pkgconf-bin (1.8.1-3) ...
Selecting previously unselected package pkgconf:s390x.
Preparing to unpack .../136-pkgconf_1.8.1-3_s390x.deb ...
Unpacking pkgconf:s390x (1.8.1-3) ...
Selecting previously unselected package libnghttp2-dev:s390x.
Preparing to unpack .../137-libnghttp2-dev_1.63.0-1_s390x.deb ...
Unpacking libnghttp2-dev:s390x (1.63.0-1) ...
Selecting previously unselected package libpsl-dev:s390x.
Preparing to unpack .../138-libpsl-dev_0.21.2-1.1_s390x.deb ...
Unpacking libpsl-dev:s390x (0.21.2-1.1) ...
Selecting previously unselected package libevent-2.1-7t64:s390x.
Preparing to unpack .../139-libevent-2.1-7t64_2.1.12-stable-10_s390x.deb ...
Unpacking libevent-2.1-7t64:s390x (2.1.12-stable-10) ...
Selecting previously unselected package libunbound8:s390x.
Preparing to unpack .../140-libunbound8_1.21.1-1_s390x.deb ...
Unpacking libunbound8:s390x (1.21.1-1) ...
Selecting previously unselected package libgnutls-dane0t64:s390x.
Preparing to unpack .../141-libgnutls-dane0t64_3.8.6-2_s390x.deb ...
Unpacking libgnutls-dane0t64:s390x (3.8.6-2) ...
Selecting previously unselected package libgnutls-openssl27t64:s390x.
Preparing to unpack .../142-libgnutls-openssl27t64_3.8.6-2_s390x.deb ...
Unpacking libgnutls-openssl27t64:s390x (3.8.6-2) ...
Selecting previously unselected package libp11-kit-dev:s390x.
Preparing to unpack .../143-libp11-kit-dev_0.25.5-2_s390x.deb ...
Unpacking libp11-kit-dev:s390x (0.25.5-2) ...
Selecting previously unselected package libtasn1-6-dev:s390x.
Preparing to unpack .../144-libtasn1-6-dev_4.19.0-3+b2_s390x.deb ...
Unpacking libtasn1-6-dev:s390x (4.19.0-3+b2) ...
Selecting previously unselected package libgnutls28-dev:s390x.
Preparing to unpack .../145-libgnutls28-dev_3.8.6-2_s390x.deb ...
Unpacking libgnutls28-dev:s390x (3.8.6-2) ...
Selecting previously unselected package librtmp-dev:s390x.
Preparing to unpack .../146-librtmp-dev_2.4+20151223.gitfa8646d.1-2+b4_s390x.deb ...
Unpacking librtmp-dev:s390x (2.4+20151223.gitfa8646d.1-2+b4) ...
Selecting previously unselected package libssl-dev:s390x.
Preparing to unpack .../147-libssl-dev_3.3.2-1_s390x.deb ...
Unpacking libssl-dev:s390x (3.3.2-1) ...
Selecting previously unselected package libssh2-1-dev:s390x.
Preparing to unpack .../148-libssh2-1-dev_1.11.0-7_s390x.deb ...
Unpacking libssh2-1-dev:s390x (1.11.0-7) ...
Selecting previously unselected package libcurl4-openssl-dev:s390x.
Preparing to unpack .../149-libcurl4-openssl-dev_8.10.1-1_s390x.deb ...
Unpacking libcurl4-openssl-dev:s390x (8.10.1-1) ...
Selecting previously unselected package libgomp1:s390x.
Preparing to unpack .../150-libgomp1_14.2.0-6_s390x.deb ...
Unpacking libgomp1:s390x (14.2.0-6) ...
Selecting previously unselected package libitm1:s390x.
Preparing to unpack .../151-libitm1_14.2.0-6_s390x.deb ...
Unpacking libitm1:s390x (14.2.0-6) ...
Selecting previously unselected package libubsan1:s390x.
Preparing to unpack .../152-libubsan1_14.2.0-6_s390x.deb ...
Unpacking libubsan1:s390x (14.2.0-6) ...
Selecting previously unselected package libgcc-14-dev:s390x.
Preparing to unpack .../153-libgcc-14-dev_14.2.0-6_s390x.deb ...
Unpacking libgcc-14-dev:s390x (14.2.0-6) ...
Selecting previously unselected package libpkgconf3:s390x.
Preparing to unpack .../154-libpkgconf3_1.8.1-3_s390x.deb ...
Unpacking libpkgconf3:s390x (1.8.1-3) ...
Selecting previously unselected package libpkgconf-dev:s390x.
Preparing to unpack .../155-libpkgconf-dev_1.8.1-3_s390x.deb ...
Unpacking libpkgconf-dev:s390x (1.8.1-3) ...
Selecting previously unselected package libstdc++-14-dev:s390x.
Preparing to unpack .../156-libstdc++-14-dev_14.2.0-6_s390x.deb ...
Unpacking libstdc++-14-dev:s390x (14.2.0-6) ...
Selecting previously unselected package libyaml-0-2:amd64.
Preparing to unpack .../157-libyaml-0-2_0.2.5-1+b1_amd64.deb ...
Unpacking libyaml-0-2:amd64 (0.2.5-1+b1) ...
Selecting previously unselected package ninja-build.
Preparing to unpack .../158-ninja-build_1.12.1-1_amd64.deb ...
Unpacking ninja-build (1.12.1-1) ...
Selecting previously unselected package python3-yaml.
Preparing to unpack .../159-python3-yaml_6.0.2-1_amd64.deb ...
Unpacking python3-yaml (6.0.2-1) ...
Selecting previously unselected package scdoc.
Preparing to unpack .../160-scdoc_1.11.3-1_amd64.deb ...
Unpacking scdoc (1.11.3-1) ...
Selecting previously unselected package sbuild-build-depends-main-dummy:s390x.
Preparing to unpack .../161-sbuild-build-depends-main-dummy_0.invalid.0_s390x.deb ...
Unpacking sbuild-build-depends-main-dummy:s390x (0.invalid.0) ...
Setting up libconfig-inifiles-perl (3.000003-3) ...
Setting up media-types (10.1.0) ...
Setting up libpipeline1:amd64 (1.5.8-1) ...
Setting up libfile-which-perl (1.27-2) ...
Setting up libkeyutils1:amd64 (1.6.3-3) ...
Setting up libicu72:amd64 (72.1-5) ...
Setting up binutils-s390x-linux-gnu (2.43.1-5) ...
Setting up gcc-14-s390x-linux-gnu-base:amd64 (14.2.0-6cross1) ...
Setting up bsdextrautils (2.40.2-9) ...
Setting up libmagic-mgc (1:5.45-3) ...
Setting up gcc-14-base:s390x (14.2.0-6) ...
Setting up libarchive-zip-perl (1.68-1) ...
Setting up libyaml-0-2:amd64 (0.2.5-1+b1) ...
Setting up libtirpc-common (1.3.4+ds-1.3) ...
Setting up libdebhelper-perl (13.20) ...
Setting up libsqlite3-0:amd64 (3.46.1-1) ...
Setting up libc6-s390x-cross (2.40-3cross1) ...
Setting up libmagic1t64:amd64 (1:5.45-3) ...
Setting up libxml-namespacesupport-perl (1.12-2) ...
Setting up gettext-base (0.22.5-2) ...
Setting up m4 (1.4.19-4) ...
Setting up gcc-14-cross-base (14.2.0-6cross1) ...
Setting up libcom-err2:amd64 (1.47.1-1) ...
Setting up file (1:5.45-3) ...
Setting up libyaml-perl (1.31-1) ...
Setting up libfakeroot:amd64 (1.36-1) ...
Setting up ninja-build (1.12.1-1) ...
Setting up libelf1t64:amd64 (0.191-2) ...
Setting up libkrb5support0:amd64 (1.21.3-3) ...
Setting up fakeroot (1.36-1) ...
update-alternatives: using /usr/bin/fakeroot-sysv to provide /usr/bin/fakeroot (fakeroot) in auto mode
Setting up libxml-sax-base-perl (1.09-3) ...
Setting up libio-string-perl (1.08-4) ...
Setting up autotools-dev (20220109.1) ...
Setting up linux-libc-dev-s390x-cross (6.11.2-1cross1) ...
Setting up cross-config (2.6.20) ...
Setting up libpkgconf3:amd64 (1.8.1-3) ...
Setting up autopoint (0.22.5-2) ...
Setting up icu-devtools (72.1-5) ...
Setting up libgcc-s1-s390x-cross (14.2.0-6cross1) ...
Setting up pkgconf-bin (1.8.1-3) ...
Setting up libncursesw6:amd64 (6.5-2) ...
Setting up libk5crypto3:amd64 (1.21.3-3) ...
Setting up scdoc (1.11.3-1) ...
Setting up cpp-14-s390x-linux-gnu (14.2.0-6cross1) ...
Setting up autoconf (2.72-3) ...
Setting up libitm1-s390x-cross (14.2.0-6cross1) ...
Setting up dwz (0.15-1+b1) ...
Setting up sensible-utils (0.0.24) ...
Setting up libc6-dev-s390x-cross (2.40-3cross1) ...
Setting up libuchardet0:amd64 (0.0.8-1+b1) ...
Setting up netbase (6.4) ...
Setting up libkrb5-3:amd64 (1.21.3-3) ...
Setting up libfile-homedir-perl (1.006-2) ...
Setting up readline-common (8.2-5) ...
Setting up libgomp1-s390x-cross (14.2.0-6cross1) ...
Setting up libxml2:amd64 (2.12.7+dfsg+really2.9.14-0.1) ...
Setting up liblocale-gettext-perl (1.07-7) ...
Setting up automake (1:1.16.5-1.3) ...
update-alternatives: using /usr/bin/automake-1.16 to provide /usr/bin/automake (automake) in auto mode
Setting up libfile-stripnondeterminism-perl (1.14.0-1) ...
Setting up gettext (0.22.5-2) ...
Setting up cpp-s390x-linux-gnu (4:14.1.0-2) ...
Setting up libtool (2.4.7-7) ...
Setting up libstdc++6-s390x-cross (14.2.0-6cross1) ...
Setting up libatomic1-s390x-cross (14.2.0-6cross1) ...
Setting up libasan8-s390x-cross (14.2.0-6cross1) ...
Setting up pkgconf:s390x (1.8.1-3) ...
Setting up intltool-debian (0.35.0+20060710.6) ...
Setting up dh-autoreconf (20) ...
Setting up libgssapi-krb5-2:amd64 (1.21.3-3) ...
Setting up ucf (3.0043+nmu1) ...
Setting up libreadline8t64:amd64 (8.2-5) ...
Setting up dh-strip-nondeterminism (1.14.0-1) ...
Setting up groff-base (1.23.0-5) ...
Setting up libubsan1-s390x-cross (14.2.0-6cross1) ...
Setting up libtirpc3t64:amd64 (1.3.4+ds-1.3) ...
Setting up po-debconf (1.0.21+nmu1) ...
Setting up man-db (2.13.0-1) ...
Not building database; man-db/auto-update is not 'true'.
Setting up libxml-sax-perl (1.02+dfsg-3) ...
update-perl-sax-parsers: Registering Perl SAX parser XML::SAX::PurePerl with priority 10...
update-perl-sax-parsers: Updating overall Perl SAX parser modules info file...

Creating config file /etc/perl/XML/SAX/ParserDetails.ini with new version
Setting up libgcc-14-dev-s390x-cross (14.2.0-6cross1) ...
Setting up libxml-libxml-perl (2.0207+dfsg+really+2.0134-5) ...
update-perl-sax-parsers: Registering Perl SAX parser XML::LibXML::SAX::Parser with priority 50...
update-perl-sax-parsers: Registering Perl SAX parser XML::LibXML::SAX with priority 50...
update-perl-sax-parsers: Updating overall Perl SAX parser modules info file...
Replacing config file /etc/perl/XML/SAX/ParserDetails.ini with new version
Setting up libnsl2:amd64 (1.3.0-3+b2) ...
Setting up libpython3.12-stdlib:amd64 (3.12.7-1) ...
Setting up python3.12 (3.12.7-1) ...
Setting up debhelper (13.20) ...
Setting up gcc-14-s390x-linux-gnu (14.2.0-6cross1) ...
Setting up gcc-s390x-linux-gnu (4:14.1.0-2) ...
Setting up libstdc++-14-dev-s390x-cross (14.2.0-6cross1) ...
Setting up g++-14-s390x-linux-gnu (14.2.0-6cross1) ...
Setting up libxml-simple-perl (2.25-2) ...
Setting up libpython3-stdlib:amd64 (3.12.6-1) ...
Setting up g++-s390x-linux-gnu (4:14.1.0-2) ...
Setting up python3 (3.12.6-1) ...
Setting up libconfig-auto-perl (0.44-2) ...
Setting up libdebian-dpkgcross-perl (2.6.20) ...
Setting up python3-yaml (6.0.2-1) ...
Setting up dpkg-cross (2.6.20) ...
Setting up crossbuild-essential-s390x (12.10) ...
Setting up libgcc-s1:s390x (14.2.0-6) ...
Setting up libc6:s390x (2.40-3) ...
Setting up libdb5.3t64:s390x (5.3.28+dfsg2-7) ...
Setting up libffi8:s390x (3.4.6-1) ...
Setting up libasan8:s390x (14.2.0-6) ...
Setting up libxxhash0:s390x (0.8.2-2+b1) ...
Setting up libattr1:s390x (1:2.5.2-1) ...
Setting up libtasn1-6:s390x (4.19.0-3+b2) ...
Setting up libext2fs2t64:s390x (1.47.1-1) ...
Setting up libbz2-1.0:s390x (1.0.8-6) ...
Setting up libtasn1-6-dev:s390x (4.19.0-3+b2) ...
Setting up libstdc++6:s390x (14.2.0-6) ...
Setting up libitm1:s390x (14.2.0-6) ...
Setting up libzstd1:s390x (1.5.6+dfsg-1) ...
Setting up libkeyutils1:s390x (1.6.3-3) ...
Setting up libicu72:s390x (72.1-5) ...
Setting up libzstd-dev:s390x (1.5.6+dfsg-1) ...
Setting up liblzma5:s390x (5.6.2-2) ...
Setting up liblz4-1:s390x (1.9.4-3) ...
Setting up libbrotli1:s390x (1.1.0-2+b4) ...
Setting up libacl1:s390x (2.3.2-2) ...
Setting up libnghttp2-14:s390x (1.63.0-1) ...
Setting up libevent-2.1-7t64:s390x (2.1.12-stable-10) ...
Setting up zlib1g:s390x (1:1.3.dfsg+really1.3.1-1) ...
Setting up libcrypt1:s390x (1:4.4.36-5) ...
Setting up libcom-err2:s390x (1.47.1-1) ...
Setting up libgomp1:s390x (14.2.0-6) ...
Setting up libkrb5support0:s390x (1.21.3-3) ...
Setting up libsasl2-modules-db:s390x (2.1.28+dfsg1-8) ...
Setting up libnettle8t64:s390x (3.10-1) ...
Setting up libpkgconf3:s390x (1.8.1-3) ...
Setting up libgmp10:s390x (2:6.3.0+dfsg-2+b1) ...
Setting up libp11-kit0:s390x (0.25.5-2) ...
Setting up libunistring5:s390x (1.2-1) ...
Setting up libatomic1:s390x (14.2.0-6) ...
Setting up liblz4-dev:s390x (1.9.4-3) ...
Setting up libk5crypto3:s390x (1.21.3-3) ...
Setting up liblzma-dev:s390x (5.6.2-2) ...
Setting up libubsan1:s390x (14.2.0-6) ...
Setting up libhogweed6t64:s390x (3.10-1) ...
Setting up libcrypt-dev:s390x (1:4.4.36-5) ...
Setting up libc6-dev:s390x (2.40-3) ...
Setting up libgcc-14-dev:s390x (14.2.0-6) ...
Setting up libstdc++-14-dev:s390x (14.2.0-6) ...
Setting up libicu-dev:s390x (72.1-5) ...
Setting up libxml2:s390x (2.12.7+dfsg+really2.9.14-0.1) ...
Setting up libbrotli-dev:s390x (1.1.0-2+b4) ...
Setting up libp11-kit-dev:s390x (0.25.5-2) ...
Setting up libbz2-dev:s390x (1.0.8-6) ...
Setting up libnghttp2-dev:s390x (1.63.0-1) ...
Setting up libattr1-dev:s390x (1:2.5.2-1) ...
Setting up libssl3t64:s390x (3.3.2-1) ...
Setting up libpkgconf-dev:s390x (1.8.1-3) ...
Setting up libidn2-0:s390x (2.3.7-2) ...
Setting up libxml2-dev:s390x (2.12.7+dfsg+really2.9.14-0.1) ...
Setting up libunbound8:s390x (1.21.1-1) ...
Setting up libgmpxx4ldbl:s390x (2:6.3.0+dfsg-2+b1) ...
Setting up comerr-dev:s390x (2.1-1.47.1-1) ...
Setting up libssl-dev:s390x (3.3.2-1) ...
Setting up libidn2-dev:s390x (2.3.7-2) ...
Setting up libsasl2-2:s390x (2.1.28+dfsg1-8) ...
Setting up zlib1g-dev:s390x (1:1.3.dfsg+really1.3.1-1) ...
Setting up libkrb5-3:s390x (1.21.3-3) ...
Setting up libssh2-1t64:s390x (1.11.0-7) ...
Setting up libext2fs-dev:s390x (1.47.1-1) ...
Setting up libarchive13t64:s390x (3.7.4-1) ...
Setting up libacl1-dev:s390x (2.3.2-2) ...
Setting up libgnutls30t64:s390x (3.8.6-2) ...
Setting up libgnutls-openssl27t64:s390x (3.8.6-2) ...
Setting up libgmp-dev:s390x (2:6.3.0+dfsg-2+b1) ...
Setting up nettle-dev:s390x (3.10-1) ...
Setting up libpsl5t64:s390x (0.21.2-1.1) ...
Setting up libldap-2.5-0:s390x (2.5.18+dfsg-3) ...
Setting up libpsl-dev:s390x (0.21.2-1.1) ...
Setting up libgnutls-dane0t64:s390x (3.8.6-2) ...
Setting up librtmp1:s390x (2.4+20151223.gitfa8646d.1-2+b4) ...
Setting up libgssapi-krb5-2:s390x (1.21.3-3) ...
Setting up libssh2-1-dev:s390x (1.11.0-7) ...
Setting up libarchive-dev:s390x (3.7.4-1) ...
Setting up libgnutls28-dev:s390x (3.8.6-2) ...
Setting up libcurl4t64:s390x (8.10.1-1) ...
Setting up librtmp-dev:s390x (2.4+20151223.gitfa8646d.1-2+b4) ...
Setting up libcurl4-openssl-dev:s390x (8.10.1-1) ...
Setting up sbuild-build-depends-main-dummy:s390x (0.invalid.0) ...
Processing triggers for libc-bin (2.40-3) ...

+------------------------------------------------------------------------------+
| Check architectures                                                          |
+------------------------------------------------------------------------------+

Arch check ok (s390x included in any)

+------------------------------------------------------------------------------+
| Build environment                                                            |
+------------------------------------------------------------------------------+

Kernel: Linux 6.1.0-23-amd64 #1 SMP PREEMPT_DYNAMIC Debian 6.1.99-1 (2024-07-15) amd64 (x86_64)
Toolchain package versions: binutils_2.43.1-5 dpkg-dev_1.22.11 g++-14_14.2.0-6 gcc-14_14.2.0-6 libc6-dev_2.40-3 libstdc++-14-dev_14.2.0-6 libstdc++-14-dev-s390x-cross_14.2.0-6cross1 libstdc++6_14.2.0-6 libstdc++6-s390x-cross_14.2.0-6cross1 linux-libc-dev_6.11.2-1
Package versions: adduser_3.137 apt_2.9.8 autoconf_2.72-3 automake_1:1.16.5-1.3 autopoint_0.22.5-2 autotools-dev_20220109.1 base-files_13.5 base-passwd_3.6.4 bash_5.2.32-1+b1 binutils_2.43.1-5 binutils-common_2.43.1-5 binutils-s390x-linux-gnu_2.43.1-5 binutils-x86-64-linux-gnu_2.43.1-5 bsdextrautils_2.40.2-9 bsdutils_1:2.40.2-9 build-essential_12.10 bzip2_1.0.8-6 comerr-dev_2.1-1.47.1-1 coreutils_9.4-3.1 cpp_4:14.1.0-2 cpp-14_14.2.0-6 cpp-14-s390x-linux-gnu_14.2.0-6cross1 cpp-14-x86-64-linux-gnu_14.2.0-6 cpp-s390x-linux-gnu_4:14.1.0-2 cpp-x86-64-linux-gnu_4:14.1.0-2 cross-config_2.6.20 crossbuild-essential-s390x_12.10 dash_0.5.12-9 debconf_1.5.87 debhelper_13.20 debian-archive-keyring_2023.4 debianutils_5.20 dh-autoreconf_20 dh-strip-nondeterminism_1.14.0-1 diffutils_1:3.10-1 dpkg_1.22.11 dpkg-cross_2.6.20 dpkg-dev_1.22.11 dwz_0.15-1+b1 fakeroot_1.36-1 file_1:5.45-3 findutils_4.10.0-3 g++_4:14.1.0-2 g++-14_14.2.0-6 g++-14-s390x-linux-gnu_14.2.0-6cross1 g++-14-x86-64-linux-gnu_14.2.0-6 g++-s390x-linux-gnu_4:14.1.0-2 g++-x86-64-linux-gnu_4:14.1.0-2 gcc_4:14.1.0-2 gcc-14_14.2.0-6 gcc-14-base_14.2.0-6 gcc-14-cross-base_14.2.0-6cross1 gcc-14-s390x-linux-gnu_14.2.0-6cross1 gcc-14-s390x-linux-gnu-base_14.2.0-6cross1 gcc-14-x86-64-linux-gnu_14.2.0-6 gcc-s390x-linux-gnu_4:14.1.0-2 gcc-x86-64-linux-gnu_4:14.1.0-2 gettext_0.22.5-2 gettext-base_0.22.5-2 gpgv_2.2.44-1 grep_3.11-4 groff-base_1.23.0-5 gzip_1.12-1.1 hostname_3.24 icu-devtools_72.1-5 init-system-helpers_1.67 intltool-debian_0.35.0+20060710.6 libacl1_2.3.2-2 libacl1-dev_2.3.2-2 libapt-pkg6.0t64_2.9.8 libarchive-dev_3.7.4-1 libarchive-zip-perl_1.68-1 libarchive13t64_3.7.4-1 libasan8_14.2.0-6 libasan8-s390x-cross_14.2.0-6cross1 libatomic1_14.2.0-6 libatomic1-s390x-cross_14.2.0-6cross1 libattr1_1:2.5.2-1 libattr1-dev_1:2.5.2-1 libaudit-common_1:4.0.1-1 libaudit1_1:4.0.1-1 libbinutils_2.43.1-5 libblkid1_2.40.2-9 libbrotli-dev_1.1.0-2+b4 libbrotli1_1.1.0-2+b4 libbsd0_0.12.2-2 libbz2-1.0_1.0.8-6 libbz2-dev_1.0.8-6 libc-bin_2.40-3 libc-dev-bin_2.40-3 libc6_2.40-3 libc6-dev_2.40-3 libc6-dev-s390x-cross_2.40-3cross1 libc6-s390x-cross_2.40-3cross1 libcap-ng0_0.8.5-2 libcap2_1:2.66-5 libcc1-0_14.2.0-6 libcom-err2_1.47.1-1 libconfig-auto-perl_0.44-2 libconfig-inifiles-perl_3.000003-3 libcrypt-dev_1:4.4.36-5 libcrypt1_1:4.4.36-5 libctf-nobfd0_2.43.1-5 libctf0_2.43.1-5 libcurl4-openssl-dev_8.10.1-1 libcurl4t64_8.10.1-1 libdb5.3t64_5.3.28+dfsg2-7 libdebconfclient0_0.272 libdebhelper-perl_13.20 libdebian-dpkgcross-perl_2.6.20 libdpkg-perl_1.22.11 libelf1t64_0.191-2 libevent-2.1-7t64_2.1.12-stable-10 libexpat1_2.6.3-1 libext2fs-dev_1.47.1-1 libext2fs2t64_1.47.1-1 libfakeroot_1.36-1 libffi8_3.4.6-1 libfile-homedir-perl_1.006-2 libfile-stripnondeterminism-perl_1.14.0-1 libfile-which-perl_1.27-2 libgcc-14-dev_14.2.0-6 libgcc-14-dev-s390x-cross_14.2.0-6cross1 libgcc-s1_14.2.0-6 libgcc-s1-s390x-cross_14.2.0-6cross1 libgcrypt20_1.11.0-6 libgdbm-compat4t64_1.24-2 libgdbm6t64_1.24-2 libgmp-dev_2:6.3.0+dfsg-2+b1 libgmp10_2:6.3.0+dfsg-2+b1 libgmpxx4ldbl_2:6.3.0+dfsg-2+b1 libgnutls-dane0t64_3.8.6-2 libgnutls-openssl27t64_3.8.6-2 libgnutls28-dev_3.8.6-2 libgnutls30t64_3.8.6-2 libgomp1_14.2.0-6 libgomp1-s390x-cross_14.2.0-6cross1 libgpg-error0_1.50-4 libgprofng0_2.43.1-5 libgssapi-krb5-2_1.21.3-3 libhogweed6t64_3.10-1 libhwasan0_14.2.0-6 libicu-dev_72.1-5 libicu72_72.1-5 libidn2-0_2.3.7-2 libidn2-dev_2.3.7-2 libio-string-perl_1.08-4 libisl23_0.27-1 libitm1_14.2.0-6 libitm1-s390x-cross_14.2.0-6cross1 libjansson4_2.14-2+b2 libk5crypto3_1.21.3-3 libkeyutils1_1.6.3-3 libkrb5-3_1.21.3-3 libkrb5support0_1.21.3-3 libldap-2.5-0_2.5.18+dfsg-3 liblocale-gettext-perl_1.07-7 liblsan0_14.2.0-6 liblz4-1_1.9.4-3 liblz4-dev_1.9.4-3 liblzma-dev_5.6.2-2 liblzma5_5.6.2-2 libmagic-mgc_1:5.45-3 libmagic1t64_1:5.45-3 libmd0_1.1.0-2 libmount1_2.40.2-9 libmpc3_1.3.1-1+b2 libmpfr6_4.2.1-1+b1 libncursesw6_6.5-2 libnettle8t64_3.10-1 libnghttp2-14_1.63.0-1 libnghttp2-dev_1.63.0-1 libnsl2_1.3.0-3+b2 libp11-kit-dev_0.25.5-2 libp11-kit0_0.25.5-2 libpam-modules_1.5.3-7 libpam-modules-bin_1.5.3-7 libpam-runtime_1.5.3-7 libpam0g_1.5.3-7 libpcre2-8-0_10.42-4+b1 libperl5.38t64_5.38.2-5 libpipeline1_1.5.8-1 libpkgconf-dev_1.8.1-3 libpkgconf3_1.8.1-3 libpsl-dev_0.21.2-1.1 libpsl5t64_0.21.2-1.1 libpython3-stdlib_3.12.6-1 libpython3.12-minimal_3.12.7-1 libpython3.12-stdlib_3.12.7-1 libquadmath0_14.2.0-6 libreadline8t64_8.2-5 librtmp-dev_2.4+20151223.gitfa8646d.1-2+b4 librtmp1_2.4+20151223.gitfa8646d.1-2+b4 libsasl2-2_2.1.28+dfsg1-8 libsasl2-modules-db_2.1.28+dfsg1-8 libseccomp2_2.5.5-1+b1 libselinux1_3.7-3 libsemanage-common_3.7-2 libsemanage2_3.7-2 libsepol2_3.7-1 libsframe1_2.43.1-5 libsmartcols1_2.40.2-9 libsqlite3-0_3.46.1-1 libssh2-1-dev_1.11.0-7 libssh2-1t64_1.11.0-7 libssl-dev_3.3.2-1 libssl3t64_3.3.2-1 libstdc++-14-dev_14.2.0-6 libstdc++-14-dev-s390x-cross_14.2.0-6cross1 libstdc++6_14.2.0-6 libstdc++6-s390x-cross_14.2.0-6cross1 libsystemd0_256.7-1 libtasn1-6_4.19.0-3+b2 libtasn1-6-dev_4.19.0-3+b2 libtinfo6_6.5-2 libtirpc-common_1.3.4+ds-1.3 libtirpc3t64_1.3.4+ds-1.3 libtool_2.4.7-7 libtsan2_14.2.0-6 libubsan1_14.2.0-6 libubsan1-s390x-cross_14.2.0-6cross1 libuchardet0_0.0.8-1+b1 libudev1_256.7-1 libunbound8_1.21.1-1 libunistring5_1.2-1 libuuid1_2.40.2-9 libxml-libxml-perl_2.0207+dfsg+really+2.0134-5 libxml-namespacesupport-perl_1.12-2 libxml-sax-base-perl_1.09-3 libxml-sax-perl_1.02+dfsg-3 libxml-simple-perl_2.25-2 libxml2_2.12.7+dfsg+really2.9.14-0.1 libxml2-dev_2.12.7+dfsg+really2.9.14-0.1 libxxhash0_0.8.2-2+b1 libyaml-0-2_0.2.5-1+b1 libyaml-perl_1.31-1 libzstd-dev_1.5.6+dfsg-1 libzstd1_1.5.6+dfsg-1 linux-libc-dev_6.11.2-1 linux-libc-dev-s390x-cross_6.11.2-1cross1 login_1:4.16.0-2+really2.40.2-9 login.defs_1:4.16.0-4 m4_1.4.19-4 make_4.3-4.1 man-db_2.13.0-1 mawk_1.3.4.20240905-1 media-types_10.1.0 mount_2.40.2-9 ncurses-base_6.5-2 ncurses-bin_6.5-2 netbase_6.4 nettle-dev_3.10-1 ninja-build_1.12.1-1 openssl-provider-legacy_3.3.2-1 passwd_1:4.16.0-4 patch_2.7.6-7 perl_5.38.2-5 perl-base_5.38.2-5 perl-modules-5.38_5.38.2-5 pkgconf_1.8.1-3 pkgconf-bin_1.8.1-3 po-debconf_1.0.21+nmu1 python3_3.12.6-1 python3-minimal_3.12.6-1 python3-yaml_6.0.2-1 python3.12_3.12.7-1 python3.12-minimal_3.12.7-1 readline-common_8.2-5 rpcsvc-proto_1.4.3-1 sbuild-build-depends-main-dummy_0.invalid.0 scdoc_1.11.3-1 sed_4.9-2 sensible-utils_0.0.24 sysvinit-utils_3.10-2 tar_1.35+dfsg-3 tzdata_2024b-3 ucf_3.0043+nmu1 usr-is-merged_39 util-linux_2.40.2-9 xz-utils_5.6.2-2 zlib1g_1:1.3.dfsg+really1.3.1-1 zlib1g-dev_1:1.3.dfsg+really1.3.1-1

+------------------------------------------------------------------------------+
| Build                                                                        |
+------------------------------------------------------------------------------+


Unpack source
-------------

-----BEGIN PGP SIGNED MESSAGE-----
Hash: SHA256

Format: 3.0 (quilt)
Source: muon-meson
Binary: muon-meson
Architecture: any
Version: 0.3.0-3
Maintainer: Andrea Pappacoda <andrea@pappacoda.it>
Homepage: https://muon.build
Standards-Version: 4.7.0
Vcs-Browser: https://salsa.debian.org/debian/muon-meson
Vcs-Git: https://salsa.debian.org/debian/muon-meson.git
Testsuite: autopkgtest
Testsuite-Triggers: @builddeps@
Build-Depends: debhelper-compat (= 13), dpkg-build-api (= 1)
Build-Depends-Arch: git <!nocheck>, libarchive-dev, libcurl4-openssl-dev | libcurl-dev, libpkgconf-dev, ninja-build, pkg-config, python3-yaml:native <!nodoc>, python3:native <!nocheck> <!nodoc>, scdoc <!nodoc>
Package-List:
 muon-meson deb devel optional arch=any
Checksums-Sha1:
 3a70e3a639e65756aac5f8064d2b1c3a73fe2cec 85128 muon-meson_0.3.0.orig-meson-docs.tar.gz
 7d0b00cec32be1220cfc666b5f0fd0e13894c855 688544 muon-meson_0.3.0.orig.tar.gz
 b144b994b7e83441f839689a7fbf1d99c06fc6ab 12392 muon-meson_0.3.0-3.debian.tar.xz
Checksums-Sha256:
 2a781073f8fdbf0f3c9dcea73cf32a37f12714d6cf0e7054d5dba245c3b564df 85128 muon-meson_0.3.0.orig-meson-docs.tar.gz
 927297432475d61d1cbe17930514e3f99391c88241ed85c98470a24bab0099f8 688544 muon-meson_0.3.0.orig.tar.gz
 aa0a212b74b2180f0003f97353d31eb7dd255960ca27adb0926235d33577d1dc 12392 muon-meson_0.3.0-3.debian.tar.xz
Files:
 82c68e0f5270798ccce3288c06bf955a 85128 muon-meson_0.3.0.orig-meson-docs.tar.gz
 55314f0f1fe8f89c82a6bff280aa8112 688544 muon-meson_0.3.0.orig.tar.gz
 f59d7e90aa1057d98b3bbb42237b72aa 12392 muon-meson_0.3.0-3.debian.tar.xz
Dgit: 8928aafea1f0980ba78dcbd56ec23df1585a1ac4 debian archive/debian/0.3.0-3 https://git.dgit.debian.org/muon-meson

-----BEGIN PGP SIGNATURE-----

iHUEARYIAB0WIQS6VuNIvZRFHt7JcAdKkgiiRVB3pwUCZvc6qAAKCRBKkgiiRVB3
p/4yAP4gXB09ApwA+1f06OkifE42d7RT7FVJzRqhDP1ROkh5lQEAoGUVL7C4jOHR
Qnv2yPAdjD1M0waHk3w3pnf891WDgAo=
=QDo/
-----END PGP SIGNATURE-----

gpgv: Signature made Fri Sep 27 23:07:20 2024 UTC
gpgv:                using EDDSA key BA56E348BD94451EDEC970074A9208A2455077A7
gpgv: Can't check signature: No public key
dpkg-source: warning: cannot verify inline signature for ./muon-meson_0.3.0-3.dsc: no acceptable signature found
dpkg-source: info: extracting muon-meson in /<<PKGBUILDDIR>>
dpkg-source: info: unpacking muon-meson_0.3.0.orig.tar.gz
dpkg-source: info: unpacking muon-meson_0.3.0.orig-meson-docs.tar.gz
dpkg-source: info: unpacking muon-meson_0.3.0-3.debian.tar.xz
dpkg-source: info: using patch list from debian/patches/series
dpkg-source: info: applying 0001-Increase-test-timeout.patch
dpkg-source: info: applying 0002-Never-use-git.patch
dpkg-source: info: applying 0003-Make-meson_reference.3-generation-reproducible.patch
dpkg-source: info: applying 0004-Fix-has_function-test-on-hurd.patch

Check disk space
----------------

Sufficient free space for build

User Environment
----------------

APT_CONFIG=/var/lib/sbuild/apt.conf
CONFIG_SITE=/etc/dpkg-cross/cross-config.s390x
DEB_BUILD_OPTIONS=nocheck
HOME=/sbuild-nonexistent
LANG=en_US.UTF-8
LC_ALL=C.UTF-8
LOGNAME=crossqa
OLDPWD=/home/crossqa
PATH=/usr/local/sbin:/usr/local/bin:/usr/sbin:/usr/bin:/sbin:/bin:/usr/games
SBUILD_CONFIG=/tmp/tmp.HL2s6QRdKY/sbuild.conf
SCHROOT_ALIAS_NAME=unstable-amd64-sbuild
SCHROOT_CHROOT_NAME=sid-amd64-sbuild
SCHROOT_COMMAND=env
SCHROOT_GID=1000
SCHROOT_GROUP=crossqa
SCHROOT_SESSION_ID=sid-amd64-sbuild-f7c2febb-7c01-407c-8ee4-7276ea6dfb39
SCHROOT_UID=1000
SCHROOT_USER=crossqa
SHELL=/bin/sh
USER=crossqa
XDG_SESSION_CLASS=user

dpkg-buildpackage
-----------------

Command: dpkg-buildpackage --sanitize-env -as390x -Pcross,nocheck -us -uc -B -rfakeroot --jobs-try=1
dpkg-buildpackage: info: source package muon-meson
dpkg-buildpackage: info: source version 0.3.0-3
dpkg-buildpackage: info: source distribution unstable
dpkg-buildpackage: info: source changed by Andrea Pappacoda <andrea@pappacoda.it>
dpkg-architecture: warning: specified GNU system type s390x-linux-gnu does not match CC system type x86_64-linux-gnu, try setting a correct CC environment variable
 dpkg-source --before-build .
dpkg-buildpackage: info: host architecture s390x
 debian/rules clean
dh clean --buildsystem=none --builddir=build
   dh_auto_clean -O--buildsystem=none -O--builddir=build
   dh_autoreconf_clean -O--buildsystem=none -O--builddir=build
   dh_clean -O--buildsystem=none -O--builddir=build
 debian/rules binary-arch
dh binary-arch --buildsystem=none --builddir=build
   dh_update_autotools_config -a -O--buildsystem=none -O--builddir=build
   dh_autoreconf -a -O--buildsystem=none -O--builddir=build
   dh_auto_configure -a -O--buildsystem=none -O--builddir=build
   debian/rules override_dh_auto_build
make[1]: Entering directory '/<<PKGBUILDDIR>>'
ln -s ../meson-docs subprojects/
CC="x86_64-linux-gnu-gcc" CFLAGS=" -g -O2" LDFLAGS="" ./bootstrap.sh build
+ dir=build
+ mkdir -p build
+ pkgconf_cmd=
+ command -v pkgconf
+ pkgconf_cmd=pkgconf
+ [ -n pkgconf ]
+ pkgconf libpkgconf
+ pkgconf_cflags=
+ pkgconf_libs=
+ x86_64-linux-gnu-gcc -g -O2 -Iinclude src/amalgam.c -o build/muon
build/muon setup -Dprefix=/usr -Dsamurai=disabled -Dreadline=bestline build
detected compiler gcc '14.2.0' (['s390x-linux-gnu-gcc']), linker: ld (['s390x-linux-gnu-ld']), static_linker: ar (['s390x-linux-gnu-ar'])
configuring 'muon', version: 0.3.0
configuring '/<<PKGBUILDDIR>>/build/version.txt'
c compiler: supports argument '-Wendif-labels': YES
c compiler: supports argument '-Wimplicit-fallthrough=2': YES
c compiler: supports argument '-Winit-self': YES
c compiler: supports argument '-Wlogical-op': YES
c compiler: supports argument '-Wmissing-include-dirs': YES
c compiler: supports argument '-Wno-missing-braces': YES
c compiler: supports argument '-Wno-missing-field-initializers': YES
c compiler: supports argument '-Wno-unused-parameter': YES
c compiler: supports argument '-Wold-style-definition': YES
c compiler: supports argument '-Woverflow': YES
c compiler: supports argument '-Wstrict-aliasing=2': YES
c compiler: supports argument '-Wstrict-prototypes': YES
c compiler: supports argument '-Wundef': YES
c compiler: supports argument '-Wvla': YES
c compiler: supports argument '-fstrict-aliasing': YES
c compiler: supports argument '-std=c99': YES
configuring '/<<PKGBUILDDIR>>/build/src/version.c'
warn libpkgconf not enabled
warn dependency ['libcurl'] not found
warn libpkgconf not enabled
warn dependency ['libarchive'] not found
warn libpkgconf not enabled
fallback ['pkgconf', 'dep_libpkgconf'] failed for 'libpkgconf'
fallback ['pkgconf', 'dep_libpkgconf'] failed for 'libpkgconf'
warn dependency ['libpkgconf'] not found
warn libpkgconf not enabled
[tinyjson] entering subproject 'tinyjson'
[tinyjson] detected compiler gcc '14.2.0' (['s390x-linux-gnu-gcc']), linker: ld (['s390x-linux-gnu-ld']), static_linker: ar (['s390x-linux-gnu-ar'])
[tinyjson] configuring 'tiny-json', version: undefined
found dependency 'tinyjson' (declared dependency) version undefined static
warn libpkgconf not enabled
[bestline] entering subproject 'bestline'
[bestline] detected compiler gcc '14.2.0' (['s390x-linux-gnu-gcc']), linker: ld (['s390x-linux-gnu-ld']), static_linker: ar (['s390x-linux-gnu-ar'])
[bestline] configuring 'bestline', version: undefined
found dependency 'bestline' (declared dependency) version undefined static
warn libpkgconf not enabled
warn dependency ['tracy'] not found
[meson-docs] entering subproject 'meson-docs'
[meson-docs] configuring 'meson', version: undefined

summary:
- muon 0.3.0
      libcurl: false
      libarchive: false
      libpkgconf: true
      docs: true
setup complete
ninja -C build --verbose
ninja: Entering directory `build'
[1/123] /<<PKGBUILDDIR>>/build/muon internal exe -c doc/meson.build.5 -f ../doc/meson.build.5.scd -e /<<PKGBUILDDIR>>/build/.muon/custom_tgt_env/meson_build_5_scd2_dat -- /usr/bin/scdoc
[2/123] /<<PKGBUILDDIR>>/build/muon internal exe -c doc/muon.1 -f ../doc/muon.1.scd -e /<<PKGBUILDDIR>>/build/.muon/custom_tgt_env/muon_1_scd1_dat -- /usr/bin/scdoc
[3/123] s390x-linux-gnu-gcc -std=c99 -g -O0 -Wpedantic -Wextra -Wall -g -O2 -Werror=implicit-function-declaration -Werror=array-bounds -Werror=clobbered -Werror=volatile-register-var -ffile-prefix-map=/<<PKGBUILDDIR>>=. -fstack-protector-strong -Wformat -Werror=format-security -DBOOTSTRAP_NO_SAMU -Wdate-time -D_FORTIFY_SOURCE=2 -Wendif-labels -Wimplicit-fallthrough=2 -Winit-self -Wlogical-op -Wmissing-include-dirs -Wno-missing-braces -Wno-missing-field-initializers -Wno-unused-parameter -Wold-style-definition -Woverflow -Wstrict-aliasing=2 -Wstrict-prototypes -Wundef -Wvla -fstrict-aliasing -std=c99 -DMUON_BOOTSTRAPPED -I tools -I ../tools -I ../include -DMUON_PLATFORM_posix -DMUON_ENDIAN=0 -MD -MQ tools/embedder.p/embedder.c.o -MF tools/embedder.p/embedder.c.o.d -o tools/embedder.p/embedder.c.o -c ../tools/embedder.c
[4/123] s390x-linux-gnu-gcc  -o tools/embedder tools/embedder.p/embedder.c.o -Wl,--as-needed -Wl,--no-undefined -g -O2 -Werror=implicit-function-declaration -Werror=array-bounds -Werror=clobbered -Werror=volatile-register-var -ffile-prefix-map=/<<PKGBUILDDIR>>=. -fstack-protector-strong -Wformat -Werror=format-security -DBOOTSTRAP_NO_SAMU -Wl,-z,relro -Wl,-z,now
[5/123] /<<PKGBUILDDIR>>/build/muon internal exe -c src/script/embedded_files.h -e /<<PKGBUILDDIR>>/build/.muon/custom_tgt_env/embedded_files0_dat -- tools/embedder ../src/script/dependencies.meson dependencies.meson ../src/script/copyfile.meson copyfile.meson ../src/script/global_options.meson global_options.meson ../src/script/per_project_options.meson per_project_options.meson ../src/script/vcs_tagger.meson vcs_tagger.meson ../src/script/gettext.meson gettext.meson ../src/script/itstool.meson itstool.meson ../src/script/msgfmthelper.meson msgfmthelper.meson ../src/script/python_info.py python_info.py ../src/script/modules/_test.meson modules/_test.meson ../src/script/modules/i18n.meson modules/i18n.meson ../src/script/modules/gnome.meson modules/gnome.meson ../src/script/html/test_out.html html/test_out.html
FAILED: src/script/embedded_files.h 
/<<PKGBUILDDIR>>/build/muon internal exe -c src/script/embedded_files.h -e /<<PKGBUILDDIR>>/build/.muon/custom_tgt_env/embedded_files0_dat -- tools/embedder ../src/script/dependencies.meson dependencies.meson ../src/script/copyfile.meson copyfile.meson ../src/script/global_options.meson global_options.meson ../src/script/per_project_options.meson per_project_options.meson ../src/script/vcs_tagger.meson vcs_tagger.meson ../src/script/gettext.meson gettext.meson ../src/script/itstool.meson itstool.meson ../src/script/msgfmthelper.meson msgfmthelper.meson ../src/script/python_info.py python_info.py ../src/script/modules/_test.meson modules/_test.meson ../src/script/modules/i18n.meson modules/i18n.meson ../src/script/modules/gnome.meson modules/gnome.meson ../src/script/html/test_out.html html/test_out.html
err /<<PKGBUILDDIR>>/build/tools/embedder: Exec format error
[6/123] s390x-linux-gnu-gcc -std=c99 -g -O0 -Wpedantic -Wextra -Wall -g -O2 -Werror=implicit-function-declaration -Werror=array-bounds -Werror=clobbered -Werror=volatile-register-var -ffile-prefix-map=/<<PKGBUILDDIR>>=. -fstack-protector-strong -Wformat -Werror=format-security -DBOOTSTRAP_NO_SAMU -Wdate-time -D_FORTIFY_SOURCE=2 -I subprojects/tinyjson -I ../subprojects/tinyjson -fpic -MD -MQ subprojects/tinyjson/libtiny-json.a.p/tiny-json.c.o -MF subprojects/tinyjson/libtiny-json.a.p/tiny-json.c.o.d -o subprojects/tinyjson/libtiny-json.a.p/tiny-json.c.o -c ../subprojects/tinyjson/tiny-json.c
[7/123] /<<PKGBUILDDIR>>/build/muon internal exe -e /<<PKGBUILDDIR>>/build/.muon/custom_tgt_env/meson_reference_33_dat -- ../subprojects/meson-docs/docs/genrefman.py -q -l fastyaml -g man -o subprojects/meson-docs/meson-reference.3 --no-modules
| WARNING: YAML reference manual loaded using the best-effort fastyaml loader.  Results are not guaranteed to be stable or correct.
[8/123] s390x-linux-gnu-gcc -std=c99 -g -O0 -Wpedantic -Wextra -Wall -g -O2 -Werror=implicit-function-declaration -Werror=array-bounds -Werror=clobbered -Werror=volatile-register-var -ffile-prefix-map=/<<PKGBUILDDIR>>=. -fstack-protector-strong -Wformat -Werror=format-security -DBOOTSTRAP_NO_SAMU -Wdate-time -D_FORTIFY_SOURCE=2 -I subprojects/bestline -I ../subprojects/bestline -fpic -MD -MQ subprojects/bestline/libbestline.a.p/bestline.c.o -MF subprojects/bestline/libbestline.a.p/bestline.c.o.d -o subprojects/bestline/libbestline.a.p/bestline.c.o -c ../subprojects/bestline/bestline.c
../subprojects/bestline/bestline.c: In function ‘GetLineChar’:
../subprojects/bestline/bestline.c:1612:17: warning: ignoring return value of ‘write’ declared with attribute ‘warn_unused_result’ [-Wunused-result]
 1612 |                 write(fout, "\n", 1);
      |                 ^~~~~~~~~~~~~~~~~~~~
ninja: build stopped: subcommand failed.
make[1]: *** [debian/rules:19: override_dh_auto_build] Error 1
make[1]: Leaving directory '/<<PKGBUILDDIR>>'
make: *** [debian/rules:13: binary-arch] Error 2
dpkg-buildpackage: error: debian/rules binary-arch subprocess returned exit status 2
--------------------------------------------------------------------------------
Build finished at 2024-10-10T08:42:13Z

Finished
--------


+------------------------------------------------------------------------------+
| Cleanup                                                                      |
+------------------------------------------------------------------------------+

Purging /<<BUILDDIR>>
Not cleaning session: cloned chroot in use
E: Build failure (dpkg-buildpackage died)

+------------------------------------------------------------------------------+
| Summary                                                                      |
+------------------------------------------------------------------------------+

Build Architecture: amd64
Build Profiles: cross nocheck
Build Type: any
Build-Space: 15608
Build-Time: 23
Distribution: unstable
Fail-Stage: build
Foreign Architectures: s390x
Host Architecture: s390x
Install-Time: 16
Job: muon-meson_0.3.0-3
Machine Architecture: amd64
Package: muon-meson
Package-Time: 48
Source-Version: 0.3.0-3
Space: 15608
Status: attempted
Version: 0.3.0-3
--------------------------------------------------------------------------------
Finished at 2024-10-10T08:42:13Z
Build needed 00:00:48, 15608k disk space